{"text_format":"1","workbook":"xlsx","n_sheets":6,"sheets":["DESIGN INPUTS AND CALCULATIONS","SCHEMATIC","data","VCOMP","Sheet1","Sheet2"],"not_rendered":{"charts":6,"images":6,"macros":1,"external_links":1,"defined_names":219,"comments":1,"pivot_tables":0},"unopened":[],"bounds":{"document_bytes":16777216,"sheet_cells":100000,"rows_first":2000,"rows_last":500,"rows_between":2000,"halvings":0,"cell_chars":16384,"cell_head_chars":4096},"cells_cut":0,"cells_raw":0,"read":"whole","date_system":"1900"}

{"sheet":"DESIGN INPUTS AND CALCULATIONS","index":0,"n_rows":268,"n_cols":16,"rows_kept":268,"cut":false,"hidden":false,"merged":[[0,0,0,3],[2,0,2,3],[3,2,3,3],[4,0,4,3],[5,0,5,3],[16,0,16,3],[21,0,21,3],[30,0,30,3],[43,0,43,3],[51,0,51,3],[62,0,62,3],[72,0,72,3],[82,0,82,3],[95,0,95,3],[114,0,114,3],[128,0,128,3],[135,0,135,3],[141,0,141,3],[155,0,155,3],[179,0,179,3],[181,0,181,3],[255,0,255,3],[6,0,10,3],[49,0,50,3],[70,0,71,3],[11,0,15,3],[28,0,29,3],[80,0,81,3],[60,0,61,3],[17,0,19,3],[126,0,127,3],[112,0,113,3],[93,0,94,3],[153,0,154,3],[139,0,140,3]]}
["UCC28180 DESIGN CALCULATOR TOOL",null,null,null,"备注"]
["TI Literature Number:","SLUC506","Rev C"]
["UCC28180 CONTINUOUS CURRENT CONDUCTION MODE PFC CONTROLLER WITH PROGRAMMABLE SWITCHING FREQUENCY"]
["Please enter design parameters into the","shaded","cells; "]
["Calculated results will be in RED"]
["Be sure to ENABLE EDITING before attempting to use this design calculator"]
["This spreadsheet guides the user through the design process of a CONTINUOUS CONDUCTION MODE PFC BOOST CONVERTER using the UCC28180.  User interaction is required in order to get the best possible results.  Enter the desired specification where prompted, the highlighted cells are for user inputs; calculations for the design are based upon the inputs."]
[]
[]
[]
[]
["WHERE APPLICABLE, A RECOMMENDED VALUE IS GIVEN THAT WILL BE THE BEST CHOICE TO MEET THE GIVEN SPECIFICATION.  IT IS IN THE BEST INTEREST OF THE USER TO USE A VALUE AS CLOSE AS POSSIBLE TO THE SUGGESTED RECOMMENDED VALUE.  FOR ACCURATE RESULTS, THE USER MUST ENTER THE ACTUAL VALUE USED IN THE APPROPRIATE CELL."]
[]
[]
[]
[]
["Disclaimer"]
["This product is designed as an aid for customers of Texas Instruments. No warranties, either expressed or implied, with respect to this software or its fitness for any particular purpose, are claimed by Texas Instruments or the author. The software is licensed solely on an \"as is\" basis. The entire risk as to its quality and performance is with the customer."]
[]
[]
[]
["INPUT:",null,null,null,null,null,{"$f":"1.15/1.13","v":1.01769911504425}]
["Minimum Input Voltage from AC Line:","VACIN(min)",172,"VRMS",null,null,{"$f":"1.38","v":1.38}]
["Maximum Input Voltage from AC Line:","VACIN(max)",{"$f":"220*1.2-1.2","v":262.8},"VRMS",null,{"$f":"Vacin_max*SQRT(2)","v":371.655324191649},{"$f":"G23/G22","v":1.356}]
["Minimum Line Frequency:","fLINE(min):",49,"Hz"]
["Maximum Line Frequency:","fLINE(max):",51,"Hz"]
["Minimum Rectified AC Line Voltage:","VIN_PEAK(min)",{"$f":"SQRT(2)*Vacin_min","v":243.244732728172},"V"]
["Maximum Rectified AC Line Voltage:","VIN_PEAK(max)",{"$f":"SQRT(2)*Vacin_max","v":371.655324191649},"V"]
[]
[]
["OUTPUT:"]
["Maximum Output Power of PFC Stage:","POUT(max)",1200,"W"]
["Output Voltage (Note: Must be > VIN_RECTIFIED(max)):","VOUT",{"$f":"Vout_nom","v":371.911764705882},"V",{"$f":"IF(Vout<=Vin_peak_max,\"OUTPUT VOLTAGE MUST BE GREATER THAN RECTIFIED MAXIMUM INPUT VOLTAGE\",\" \")","v":" "}]
["Target Power Factor, VIN(nom), Full Load:","PF",0.99,null,{"$f":"IF(PF>=0.999,\"ENTER VALUE LESS THAN 0.999\",\" \")","v":" "}]
["Predicted Efficiency:","h",0.96,null,{"$f":"IF(eff>=0.97,\"ENTER VALUE LESS THAN 0.97\",\" \")","v":" "}]
["Maximum Ambient Temperature:","TAMB(max)",65,"°C"]
["Maximum Average Output Current of PFC Stage:","IOUT",{"$f":"Pout/Vout","v":3.22657176749704},"A"]
["Desired Switching Frequency:","fSW(target)",48.624,"kHz",{"$f":"IF(fSW_target<18,\"fsw must not be less than 18 kHz\",IF(fSW_target>250,\"fsw must not be greater than 250 kHz\",\"\"))","v":""}]
["Recommended Resistor value on FREQ to Set the Switching Frequency, fSW:","RFREQ(recommended)",{"$f":"data!F233","v":44.2},"kΩ"]
["Actual Value For RFREQ Used: ","RFREQ =",44.2,"kΩ",null,44.2,"48.624k"]
["Resultant Switching Frequency, fSW:","fSW",{"$f":"((32.7*kOhms*65*kHz*(1*MegOhm+Rfreq*kOhms))/(Rfreq*kOhms*(1*MegOhm+32.7*kOhms)))/kHz","v":48.6237390279052},"kHz",null,45.3,"47.493k"]
[{"$f":"IF(Vout>=Vin_peak_max,IF(PF<1,IF(eff<0.97,\"\",\"DO NOT PROCEED. ENTER EFFICIENCY LESS < 0.97\"),\"DO NOT PROCEED. ENTER PF < 1\"),\"DO NOT PROCEED. OUTPUT VOLTAGE MUST BE > RECTIFIED MAXIMUM INPUT VOLTAGE\")","v":""}]
[]
["Line Current:"]
["Maximum Input Power Drawn from the Line:","PIN(max)",{"$f":"Pout/eff","v":1250},"W"]
["Maximum RMS AC Line Current:","IIN_RMS(max)",{"$f":"Pout/(eff*Vacin_min*PF)","v":7.34085036410618},"A",null,{"$f":"C48/10-1","v":-0.339091264272738},{"$f":"91*100/191","v":47.6439790575916}]
["Maximum Peak AC Line Current, assuming sinusoidal:","IIN_PEAK(max)",{"$f":"SQRT(2)*Iin_rms_max","v":10.3815301442704},"A",null,null,{"$f":"43.8*2","v":87.6}]
["Maximum Average AC Line Current, assuming sinusoidal:","IIN_AVG(max)",{"$f":"(2*Iin_peak_max)/PI()","v":6.60908735727263},"A"]
["Minimum Input Fuse Rating:","IFUSE",{"$f":"1.39*Iin_rms_max","v":10.2037820061076},"A"]
[]
[]
["BRIDGE RECTIFIER:"]
["Bridge Rectifier Forward Voltage, at IIN_PEAK(max):","VF_BRIDGE",0.95,"V"]
["Bridge Rectifier Thermal Resistance, Junction to Case:","RqJC(Bridge)",2.2,"°C/W"]
["Case to Heatsink Thermal Resistance:","RθCHS(Bridge)",0.7,"°C/W"]
["Bridge Rectifier Maximum Junction Temperature:","TJ(max)",125,"°C"]
["Bridge Rectifier Minimum Average Current Rating:","IBRIDGE(rated)",{"$f":"1.5*Iin_avg_max","v":9.91363103590894},"A"]
["Bridge Rectifier Minimum DC Blocking Voltage Rating:","VDC_BLOCKING(rated)",{"$f":"Vin_peak_max*1.1","v":408.820856610814},"V"]
["Bridge Rectifier Power Dissipation:","PBRIDGE",{"$f":"2*Vf_bridge*Iin_avg_max","v":12.557265978818},"W"]
["Required Heat Sink Thermal Impedance:","RqHS_AMB(Bridge)",{"$f":"((Tj_bridge-Tamb)/Pbridge)-Rjc_bridge-Rchs_bridge","v":1.87811014763962},"°C/W"]
[]
[]
["INPUT CAPACITOR:"]
["Inductor Peak-to-Peak Current Ripple Factor (i.e. 0.2 for 20%, 0.3 for 30%). Percentage of minimum input, maximum load, inductor current at 50% duty cycle operating point, not recommended to be > 0.4:","LI_ripple_factor(target)",0.4,{"$f":"IF(L_I_ripple_factor>0.4,\"Lower ripple current factor is recommended\",\"\")","v":""},null,null,{"$f":"C76/0.5-1","v":-0.0790411862927418}]
["Maximum High Frequency Voltage Ripple Factor (i.e. 0.03 for 3%, 0.09 for 9%):","VCin_ripple_factor",0.05]
["Target Maximum Allowable Inductor Current Ripple:","IRIPPLE(target)",{"$f":"L_I_ripple_factor*Iin_peak_max","v":4.15261205770817},"A"]
["Maximum Inductor Voltage Ripple:","VIN_RIPPLE",{"$f":"V_ripplefactor*Vin_peak_min","v":12.1622366364086},"V"]
["Recommended Input Capacitor Value:","CIN(recommended)",{"$f":"data!F228","v":0.82},"mF"]
["Actual Value of Input Capacitor Used:","CIN",1,{"$f":"data!G228","v":"µF"}]
["Required Minimum Voltage Rating for CIN:","VCIN(rating)",{"$f":"Vrated","v":408.820856610814},"V"]
[]
[]
["BOOST INDUCTOR DESIGN:"]
["Maximum Duty Cycle:","DUTY(max)",{"$f":"(Vout-Vin_peak_min)/Vout","v":0.345961177322431}]
["Maximum Inductor Peak Current:","IL_PEAK(max)",{"$f":"Iin_peak_max+(Iripple/2)","v":12.4578361731245},"A"]
["Minimum Recommended Boost Inductor Value:","LBST(recommended)",{"$f":"((Vout*0.5*(1-0.5))/(fsw*kHz*Iripple))/mH","v":0.460479406853629},"mH"]
["Actual Boost Inductor Value Used:","LBST(actual) =",0.468,"mH"]
["Actual Maximum Inductor Ripple Current:","IRIPPLE(actual)",{"$f":"(Vout*0.5*(1-0.5))/((fsw*kHz)*(Lbst*mH))","v":4.08588106245018},"A",null,"电感值"]
["Actual Maximum Inductor Peak Current:","IL_PEAK(actual)",{"$f":"Iin_peak_max+(Iripple_actual/2)","v":12.4244706754955},"A",{"$f":"Il_peak_actual/SQRT(2)","v":8.78542746729627},10,{"$f":"1-E79/F79","v":0.121457253270373}]
["Resultant Inductor Current Ripple Factor:","LI_ripple_factor(actual)",{"$f":"Iripple_actual/(SQRT(2)*Iin_rms_max)","v":0.393572142609939}]
[null,null,null,null,null,null,null,null,"☆","☆"]
[null,null,null,null,null,"TI推荐参数","TI推荐参数","重庆平伟实业","ZJ-FAIRCHILD","华微TO2472L","华微TO220MF","杨杰TO247（10.88）","杨杰TO220_SIC","WEEN","WEEN","MCC"]
["BOOST DIODE:",null,null,null,null,"CREE","wang",null,"FFH30S60S","30F60W","20F60UMF","MUR3060PL","YJD106510PG1","BYC30W-600PT2","BYC30W-600PT2","MUR3060BL"]
["Forward Voltage Drop, at IL_PEAK(max),125°C:","VF",1.2,"V",null,1.65,1.4,1.2,1.6,2,2,{"$f":"2","v":2},1.625,1.38,1.2,1.3]
["Reverse Recovery Charge:25℃","QRR",25,"nC",null,62,20,null,34,23,34,106.7,22.8,51,47]
["Boost Diode Maximum Junction Temperature:","TJ(max)",175,"°C",null,125,125,125,125,120,{"$f":"150*0.8","v":120},{"$f":"175*0.8","v":140},{"$f":"175*0.8","v":140},{"$f":"175*0.8","v":140},{"$f":"175*0.8","v":140}]
["Boost Diode Thermal Resistance, Junction to Case:","RqJC(Diode)",2.37,"°C/W",null,0.8,1.2,1,1.1,0.8,0.8,1,1,1,1]
["Boost Diode Thermal Resistance, Case to Heatsink:","RqCHS(Diode)",0.7,"°C/W",null,0.7,0.7,0.7,0.7,0.7,0.7,0.7,0.7,0.8,0.8]
["Boost Diode Conduction Losses:","PDIODE(cond)",{"$f":"Vf*Iout","v":3.87188612099645},"W",null,{"$f":"F84*Iout","v":5.32384341637011},4.51720047449585,3.87188612099645,5.16251482799526,6.45314353499408,6.45314353499408,{"$f":"L84*Iout","v":6.45314353499408},{"$f":"M84*Iout","v":5.24317912218269},{"$f":"N84*Iout","v":4.45266903914591},{"$f":"O84*Iout","v":3.87188612099645}]
["Reverse Recovery Losses:","PREVERSE",{"$f":"(65*10^3)*Vout*(Qrr*10^-9)","v":0.604356617647058},"W",null,{"$f":"(65*10^3)*Vout*(F85*10^-9)","v":1.4988044117647},0.483485294117647,0,0.821924999999999,0.556008088235294,0.821924999999999,{"$f":"(65*10^3)*Vout*(L85*10^-9)","v":2.57939404411764},{"$f":"(65*10^3)*Vout*(M85*10^-9)","v":0.551173235294117},{"$f":"(65*10^3)*Vout*(N85*10^-9)","v":1.2328875},{"$f":"(65*10^3)*Vout*(O85*10^-9)","v":1.13619044117647}]
["Total Boost Diode Losses:","PDIODE(total)",{"$f":"Pdiode_cond+(Pdiode_reverse/2)","v":4.17406442981997},"W",null,{"$f":"F89+(F90/2)","v":6.07324562225246},4.75894312155468,3.87188612099645,5.57347732799526,6.73114757911172,6.86410603499407,7.7428405570529,5.51876573982975,5.06911278914591,4.43998134158468]
["Required Heat Sink Thermal Impedance:","RqHS_AMB(Diode)",{"$f":"((Tj_diode-Tamb)/Pdiode)-Rth_diode-Rth_case_hs","v":23.2832108450813},"°C/W",null,{"$f":"((F86-Tamb)/F91)-F87-F88","v":8.37939624575023},10.7078413772676,13.7963235294117,8.96527210375889,6.67096926691631,6.51269673277235,{"$f":"((L86-Tamb)/L91)-L87-L88","v":7.98636761242398},{"$f":"((M86-Tamb)/M91)-M87-M88","v":11.889995215545},{"$f":"((N86-Tamb)/N91)-N87-N88","v":12.9954885045351},{"$f":"((O86-Tamb)/O91)-O87-O88","v":15.091962877761}]
["Required Diode Blocking Voltage:","VBLOCKING",{"$f":"Vout*1.1","v":409.10294117647},"V",null,{"$f":"Vout*1.1","v":409.10294117647},409.10294117647,409.10294117647,409.10294117647,409.10294117647,409.10294117647,409.10294117647,409.10294117647,409.10294117647,409.10294117647]
[]
[null,null,null,null,null,"TI推荐参数","TI推荐参数","重庆平伟实业☆","丽隽","华微","美的MCC"]
["SWITCHING ELEMENT:",null,null,null,null,"infineon","wang","20N65YS",null,"TT040U065EQ","MSJW20N65"]
["VCC Bias Voltage to the UCC28180:","VCC",15.2,"V",null,16.2,16.2,16.2,16.2,16.2,16.2]
["Gate-Source Voltage:","VGS",{"$f":"IF(VCC>=15.2,15.2,VCC-1.25)","v":15.2},"V",null,{"$f":"IF(VCC>=15.2,15.2,VCC-1.25)","v":15.2},{"$f":"IF(VCC>=15.2,15.2,VCC-1.25)","v":15.2},{"$f":"IF(VCC>=15.2,15.2,VCC-1.25)","v":15.2},{"$f":"IF(VCC>=15.2,15.2,VCC-1.25)","v":15.2},{"$f":"IF(VCC>=15.2,15.2,VCC-1.25)","v":15.2},{"$f":"IF(VCC>=15.2,15.2,VCC-1.25)","v":15.2}]
["Drain-Source RMS Current:","IDS_RMS",{"$f":"(Pout/Vin_peak_min)*SQRT((2-(16*Vin_peak_min/(3*PI()*Vout))))","v":4.6532038795046},"A",null,{"$f":"(Pout/Vin_peak_min)*SQRT((2-(16*Vin_peak_min/(3*PI()*Vout))))","v":4.6532038795046},{"$f":"(Pout/Vin_peak_min)*SQRT((2-(16*Vin_peak_min/(3*PI()*Vout))))","v":4.6532038795046},{"$f":"(Pout/Vin_peak_min)*SQRT((2-(16*Vin_peak_min/(3*PI()*Vout))))","v":4.6532038795046},{"$f":"(Pout/Vin_peak_min)*SQRT((2-(16*Vin_peak_min/(3*PI()*Vout))))","v":4.6532038795046},{"$f":"(Pout/Vin_peak_min)*SQRT((2-(16*Vin_peak_min/(3*PI()*Vout))))","v":4.6532038795046},{"$f":"(Pout/Vin_peak_min)*SQRT((2-(16*Vin_peak_min/(3*PI()*Vout))))","v":4.6532038795046}]
["FET On-Resistance at  TJ = 125°C: ","RDSon",0.05,"W",null,0.095,0.145,0.145,0.089,{"$f":"2/40","v":0.05},{"$f":"0.15","v":0.15}]
["FET Gate Charge at VGS:","Qg",79.2,"nC",null,45,42,25,45,79.2,39]
["FET Rise Time:","tr",86,"ns",null,12,10,3,13,86,59]
["FET Fall Time:","tf",54,"ns",null,7,6,9,13,54,44]
["FET Output Capacitance:","COSS",193,"pF",null,33,62,113,97,193,61]
["FET Maximum Junction Temperature:","TJ(max)",125,"°C",null,125,125,125,125,125,125]
["FET Thermal Resistance, Junction to Case:","RqJC(FET)",0.44,"°C/W",null,0.98,1.135,0.83,0.39,0.44,0.44]
["FET Thermal Resistance, Case to Heatsink:","RqCHS(FET)",0.7,"°C/W",null,0.7,0.7,0.83,0.83,0.7,0.7]
["Gate Drive Losses (actually dissipated in the gate drive circuitry):","PGATE",{"$f":"Vgs*Qg*(nC)*fsw*kHz","v":0.0585352019913534},"W",null,{"$f":"F98*F101*(nC)*fsw*kHz","v":0.0332586374950871},{"$f":"G98*G101*(nC)*fsw*kHz","v":0.0310413949954147},{"$f":"H98*H101*(nC)*fsw*kHz","v":0.018477020830604},{"$f":"I98*I101*(nC)*fsw*kHz","v":0.0332586374950871},{"$f":"J98*J101*(nC)*fsw*kHz","v":0.0585352019913534},{"$f":"K98*K101*(nC)*fsw*kHz","v":0.0288241524957422}]
["FET Conduction Losses:","PCOND",{"$f":"(Ids_rms^2)*(Rds_on)","v":1.08261531721183},"W",null,{"$f":"(Ids_rms^2)*(F100)","v":2.05696910270248},{"$f":"(Ids_rms^2)*(G100)","v":3.13958441991431},{"$f":"(Ids_rms^2)*(H100)","v":3.13958441991431},{"$f":"(Ids_rms^2)*(I100)","v":1.92705526463706},{"$f":"(Ids_rms^2)*(J100)","v":1.08261531721183},{"$f":"(Ids_rms^2)*(K100)","v":3.2478459516355}]
["FET Switching Losses:","PSW",{"$f":"((fsw*kHz)/2)*(((tr_FET+tf_FET)*ns*Vout*Iin_peak_max)+(Coss*picoF*Vout^2))","v":13.7905990047356},"W",null,{"$f":"((fsw*kHz)/2)*(((F102+F103)*ns*Vout*Iin_peak_max)+(F104*picoF*Vout^2))","v":1.89447220331635},{"$f":"((fsw*kHz)/2)*(((G102+G103)*ns*Vout*Iin_peak_max)+(G104*picoF*Vout^2))","v":1.71038741643959},{"$f":"((fsw*kHz)/2)*(((H102+H103)*ns*Vout*Iin_peak_max)+(H104*picoF*Vout^2))","v":1.50641529516479},{"$f":"((fsw*kHz)/2)*(((I102+I103)*ns*Vout*Iin_peak_max)+(I104*picoF*Vout^2))","v":2.76676913444919},{"$f":"((fsw*kHz)/2)*(((J102+J103)*ns*Vout*Iin_peak_max)+(J104*picoF*Vout^2))","v":13.7905990047356},{"$f":"((fsw*kHz)/2)*(((K102+K103)*ns*Vout*Iin_peak_max)+(K104*picoF*Vout^2))","v":9.87357970325662}]
["FET Losses, Total:","PFET",{"$f":"P_FETcond+P_FETsw","v":14.8732143219474},"W",null,{"$f":"F109+F110","v":3.95144130601883},4.8499718363539,4.64599971507911,4.69382439908625,14.8732143219474,13.1214256548921]
["Required Heat Sink Thermal Impedance:","RqHS_AMB(FET)",{"$f":"((Tj_FET-Tamb)/P_FET)-Rth_jc_FET-Rth_CHS_FET","v":2.89409772099243},"°C/W",null,{"$f":"((Tj_FET-Tamb)/P_FET)-Rth_jc_FET-Rth_CHS_FET","v":2.89409772099243},{"$f":"((Tj_FET-Tamb)/P_FET)-Rth_jc_FET-Rth_CHS_FET","v":2.89409772099243},{"$f":"((Tj_FET-Tamb)/P_FET)-Rth_jc_FET-Rth_CHS_FET","v":2.89409772099243},{"$f":"((Tj_FET-Tamb)/P_FET)-Rth_jc_FET-Rth_CHS_FET","v":2.89409772099243},{"$f":"((Tj_FET-Tamb)/P_FET)-Rth_jc_FET-Rth_CHS_FET","v":2.89409772099243},{"$f":"((Tj_FET-Tamb)/P_FET)-Rth_jc_FET-Rth_CHS_FET","v":2.89409772099243}]
[]
[null,null,null,null,null,{"$f":"C99/13-1","v":-0.642061240038108}]
["CURRENT SENSE RESISTOR:"]
["Ideal Value for RSENSE, for 110% Inductor SOC Threshold:","RSENSE(ideal)",{"$f":"0.259/(Il_peak_actual*1.1)","v":0.0189508713573551},"W"]
["Actual Value for RSENSE: Current Sense Resistor:","RSENSE",0.019,"W",{"$f":"IF(Rsense>0.259/I_Lpeak,\"DECREASE Rsense\",\"\")","v":""}]
["ICOMP Voltage at Vin_Min, ICOMP to be <5.7V to avoid ICOMP amp saturation","ICOMP",{"$f":"VCOMP!Z7","v":6},"V",{"$f":"IF(C118>5.7,\"DECREASE Rsense\",\"\")","v":"DECREASE Rsense"},"ICOMP 电压在 Vin_Min，ICOMP 为 <5.7V，以避免 ICOMP 电流饱和"]
["Inductor Current at Soft Over-Current Threshold:","IOVERCURRENT_SOC",{"$f":"0.259/Rsense","v":13.6315789473684},"A"]
["Power Dissipated in RSENSE:","PRsense",{"$f":"(Iin_rms_max^2)*Rsense","v":1.02387359729576},"W",null,{"$f":"SQRT(3/0.01)*2.5","v":43.3012701892219}]
["Theoretical Output Over-Current Inception Point:","IOUT_OVERCURRENT",{"$f":"(((Isoc-((Vout*Dmax*(1-Dmax))/(fsw*kHz*Lbst*mH)/2))*Vacin_min*PF)/(SQRT(2))*eff)/Vout","v":3.66200384806751},"A"]
["Maximum ISENSE Peak Current Limit Threshold:","IPCL",{"$f":"0.438/Rsense","v":23.0526315789474},"A"]
["Resistance of Thermistor at 25°C:","RTHERM",120,"W"]
["Maximum Inrush Current:","IINRUSH",{"$f":"Vin_peak_max/C123","v":3.09712770159708},"A"]
["Recommended ISENSE Series Resistor:","RISENSE",220,"W",null,null,null,{"$f":"0.012*1.01","v":0.01212}]
["Recommended ISENSE Filter Capacitor:","CISENSE",2000,{"$f":"data!G276","v":"pF"},null,{"$f":"data!F276","v":1800},null,null,null,{"$f":"data!F276","v":1800}]
[]
[]
["OUTPUT CAPACITOR:"]
["Required Minimum Output Voltage:","VOUT_HOLDUP(min)",160,"V",{"$f":"IF(Vout_holdup>Vout,\"ENTER A LOWER VALUE FOR THE MINIMUM HOLDUP VOLTAGE\",\"\")","v":""}]
["Desired Number of Line Cycles For Output Holdup Time  (typ one line cycle):","NHOLD_UP",1]
["Minimum Output Voltage Holdup Time:","tHold_UP(min)",{"$f":"Nholdup*((1/fline_min)/ms)","v":20.4081632653061},"ms"]
["Recommended Minimum Output Capacitor Value:","COUT(recommended)",{"$f":"data!F236","v":470},{"$f":"data!G236","v":"µF"}]
["Actual Output Capacitor Value:","COUT",470,{"$f":"data!G236","v":"µF"},{"$f":"IF(Cout<C133,\"INCREASE OUTPUT CAPACITANCE TO AT LEAST MINIMUM RECOMMENDED VALUE\",\"\")","v":""},{"$f":"Cout_rcmd/0.9","v":522.222222222222}]
["Output Voltage Peak to Peak Ripple:","VOUT_RIPPLEpp",{"$f":"Iout/(PI()*2*2*fline_min*Cout*uF)","v":11.1490413816306},"V"]
[{"$f":"IF(Vout_ripplepp>=0.04*Vout,\"OUTPUT CAPACITOR must be sized larger so OVP/UVD is not triggered\",\"Good! Output voltage peak-peak ripple is less than 5% VOUT\")","v":"Good! Output voltage peak-peak ripple is less than 5% VOUT"},null,null,null,null,{"$f":"Vout_ripplepp/380","v":0.0293395825832385}]
["Output Capacitor Ripple Current at Twice Line Frequency:","ICout_2fline",{"$f":"Iout/SQRT(2)","v":2.28153077678222},"ARMS"]
["Output Capacitor High Frequency Ripple Current:","ICout_HF",{"$f":"Iout*SQRT(((16*Vout)/(3*PI()*Vin_peak_min))-1.5)","v":3.37735177869938},"ARMS"]
["Total Output Capacitor Ripple Current:","ICout_RMS(total)",{"$f":"SQRT((Icout_2fline^2)+(Icout_HF^2))","v":4.0757683597683},"ARMS"]
[{"$f":"IF(Vout_ripplepp>0.04*Vout,\"OUTPUT CAPACITOR MUST BE INCREASED TO PREVENT OVP DURING NORMAL OPERATING RANGE\",\"\")","v":""}]
[]
["OUTPUT VOLTAGE SET POINT:"]
["Recommended Value for the Top Divider Resistor:","RFB1(recommended)",1,"MW"]
["Actual Value of the Top Divider Resistor:","RFB1(actual)",0.998,"MW",{"$f":"IF(R_fb1<0.953,\"RECOMMENDED VALUE IS GREATER THAN OR EQUAL TO 1M\",\"\")","v":""}]
["Recommended Value for the Bottom Divider Resistor (E48 Series):","RFB2(recommended)",{"$f":"data!F242","v":13.3},"kW"]
["Actual Value of the Bottom Divider Resistor:","RFB2(actual)",{"$f":"13.3+0.3","v":13.6},"kW",null,{"$f":"0.91+12.7","v":13.61}]
["Actual Nominal Output Voltage:","VOUT",{"$f":"VREF*((R_fb1*MegOhm)+(R_fb2*kOhms))/(R_fb2*kOhms)","v":371.911764705882},"V",{"$f":"IF(Vout_min<Vin_peak_max,\"DO NOT PROCEED WITHOUT ADJUSTING THE RESISTOR DIVIDER IN ORDER TO ACHIEVE THE DESIRED OUTPUT VOLTAGE\",IF(Vout_nom>1.1*Vout,\"ADJUST BOTTOM DIVIDER RESISTOR FOR DESIRED OUTPUT VOLTAGE\",\"\"))","v":"DO NOT PROCEED WITHOUT ADJUSTING THE RESISTOR DIVIDER IN ORDER TO ACHIEVE THE DESIRED OUTPUT VOLTAGE"}]
["Minimum Output Voltage with respect to VREF:","VOUT(min)",{"$f":"VREFmin*((R_fb1*MegOhm)+(R_fb2*kOhms))/(R_fb2*kOhms)","v":366.705},"V"]
["Maximum Output Voltage with respect to VREF:","VOUT(max)",{"$f":"VREFmax*((R_fb1*MegOhm)+(R_fb2*kOhms))/(R_fb2*kOhms)","v":377.118529411765},"V"]
["OVP Set Point: Typical DC Output Voltage to Trigger OVP:","VOVP",{"$f":"(VREF*1.09)*((R_fb1*MegOhm)+(R_fb2*kOhms))/(R_fb2*kOhms)","v":405.383823529412},"V"]
["UVD Set Point: Typical DC Output Voltage to Trigger UVD:","VUVD",{"$f":"(VREF*0.95)*((R_fb1*MegOhm)+(R_fb2*kOhms))/(R_fb2*kOhms)","v":353.316176470588},"V"]
["Recommended Value for Filter Capacitor on VSENSE:","CVSENSE",{"$f":"data!F245","v":680},{"$f":"data!G245","v":"pF"}]
["Power Dissipated in Voltage Divider:","PRfB1+RFB2",{"$f":"(Vout_nom^2)/((R_fb1*MegOhm)+(R_fb2*kOhms))","v":0.136732266435986},"W"]
[{"$f":"IF(Vout_min<Vin_peak_max,\"DO NOT PROCEED UNTIL RFB2 IS DECREASED SO MINIMUM OUTPUT VOLTAGE > MAXIMUM RECTIFIED INPUT VOLTAGE\",\"\")","v":"DO NOT PROCEED UNTIL RFB2 IS DECREASED SO MINIMUM OUTPUT VOLTAGE > MAXIMUM RECTIFIED INPUT VOLTAGE"}]
[]
["COMPENSATION:"]
[]
[]
[]
[]
[]
[]
[]
[]
[]
[]
[]
[]
[]
[]
[]
[]
[]
[]
[]
[]
[]
[]
[]
["The Loop will be Optimized at a Selected Specific Line Voltage.  For a Wide Input Range, Optimization is Recommended at the Mean of Min and Max Input.  For a Design with a Specific Nominal Line Voltage, Optimize at that Nominal Voltage. VCOMP at Any Line Voltage or as a Function of Load is Shown at Right",null,null,null,null,"To Determine VCOMP for a Specific Line Voltage at Full Load:"]
["Line Voltage for Optimized Loop Design:","VINnom",220,"V",null,null,"Enter Line Voltage for VCOMP calculation",null,"VLINE",220,"VRMS"]
["Open Loop Transfer Function for Current Loop:  ",null,null,null,null,null,"Resultant VCOMP at Full Load",null,"VCOMP at VLINE",{"$f":"VCOMP!B44","v":2.55958597404655},"V"]
["Product of the Voltage Loop Variables:","M1M2",{"$f":"M1M2","v":0.155290385993417},"V/ms",null,null,"Resultant ICOMP at Full Load",null,"VCOMP at VLINE",{"$f":"VCOMP!B45","v":6},"V",{"$f":"IF(J183>5.7,\"DECREASE Rsense\",\"\")","v":"DECREASE Rsense"}]
["VCOMP Voltage at VINnom:","VCOMP",{"$f":"data!H69","v":2.55958597404655},"V",null,"To Determine VCOMP at Selected Line Voltage and at a Specific Load, enter a value from 1 to 100 for 1% to 100% load:"]
["Internal Current Loop Gain Factor M1:","M1",{"$f":"IF(Vcomp<1,(0.068),IF(Vcomp<2,(0.156*Vcomp-0.0088),IF(Vcomp<4.5,(0.313*Vcomp-0.401),IF(Vcomp<5,1.007,\"VCOMP MUST BE <5\"))))","v":0.400150409876569}]
["Internal Voltage Loop PWM Ramp Slope M2:","M2",{"$f":"IF(Vcomp<=0.5,0,IF(Vcomp<4.6,(((fsw*kHz)/ftyp)*0.1223*(Vcomp-0.5)^2),IF(Vcomp<5,(((fsw*kHz)/ftyp)*2.056),\"VCOMP MUST BE <5\")))","v":0.388080037307267},"V/ms",null,null,"Percentage of Full Load for VCOMP Calculation:",null,"% of Full Load:",100,"%"]
["Non-Linear Gain Voltage Loop Variable M3:","M3",{"$f":"IF(Vcomp<0.5,(0),IF(Vcomp<1,((fsw*kHz)/ftyp)*(0.0166328*Vcomp-0.0083164),IF(Vcomp<2,((fsw*kHz)/ftyp)*(0.0572364*Vcomp^2-0.0596824*Vcomp+0.0155321),IF(Vcomp<4.5,((fsw*kHz)/ftyp)*(0.1148397*Vcomp^2-0.1746444*Vcomp+0.058612275),IF(Vcomp<4.6,((fsw*kHz)/ftyp)*(0.24631222*Vcomp-0.1231561),IF(Vcomp<5,0,\"VCOMP MUST BE <5\"))))))","v":0.272266724559276},"V/ms",null,null,"Resultant VCOMP at Selected Load",null,"VCOMP at %load selected",{"$f":"VCOMP!E45","v":2.55958597404655},"V"]
["Maximum Recommended ICOMP Capacitor Value:","CICOMPmax(recommended)",{"$f":"data!F252","v":6800},{"$f":"data!G252","v":"pF"}]
["Minimum Recommended ICOMP Capacitor Value:","CICOMPmin(recommended)",{"$f":"data!F257","v":3300},{"$f":"data!G257","v":"pF"}]
["Actual Value Used for ICOMP Capacitor:","CICOMP(actual)",680,"pF"]
["Resultant Actual Current Averaging Pole Frequency:","fIAVG(actual)",{"$f":"((gmi*M_1)/(K_1*2*PI()*Cicomp*picoF))/kHz","v":12.7104243543065},"kHz"]
[]
[]
[]
[]
[]
[]
[]
[]
[]
[]
[]
[]
[]
[]
[]
[]
[]
[]
[]
[]
[]
[]
[]
[]
[]
[]
[]
[]
[]
[]
[]
[]
[]
[]
[]
[]
[]
[]
[]
[]
[]
[]
[]
[]
[]
[]
[]
[]
[]
[]
[]
[]
[]
[]
[]
[]
[]
[]
[]
[]
[]
[]
[]
[]
["Open Loop Transfer Function for Voltage Loop:  "]
["PWM to Power Stage Pole:","fPWM_PS(pole)",{"$f":"1/((2*PI()*K_1*2.5*Rsense*(Vout_nom^3)*(Cout*uF))/(K_FQ*(M1M2/us)*(Vacin_nom^2)))","v":2.98831359979551},"Hz"]
["Desired Voltage Loop Crossover Frequency ( fV < 20Hz):","fV",10,"Hz"]
["Open Loop Voltage Gain at Desired fV:","GVLdB(fV)",{"$f":"20*LOG(IMABS(IMPRODUCT((R_fb2*kOhms)/((R_fb1*MegOhm)+(R_fb2*kOhms)),IMDIV((M_3*Vout_nom)/(M1M2),COMPLEX(1,(2*PI()*fv)/(2*PI()*fPWM_PSpole))))))","v":7.99344769693086},"dB",{"$f":"IF(fv>20,\"SET CROSSOVER FREQUENCY TO LESS THAN 20Hz\",\"\")","v":""}]
["Recommended Value for the Voltage Compensation Capacitor:","CVCOMP(recommended)",{"$f":"data!F262","v":6.8},{"$f":"data!G262","v":"µF"}]
["Actual Value Used for CVCOMP Capacitor:","CVCOMP(actual)",10,"mF"]
["Recommended Value for the Voltage Compensation Resistor:","RVCOMP(recommended)",{"$f":"data!F267","v":5.36},"kW"]
["Actual Value Used for RVCOMP Resistor:","RVCOMP(actual)",5.11,"kW"]
["Resultant Value of Voltage Compensation Zero:","fZERO",{"$f":"1/(2*PI()*(Rvcomp*kOhms)*(Cvcomp*uF))","v":3.11457814269854},"Hz",{"$f":"IF(Rvcomp>1.1*C262,\"USE A SMALLER VALUE FOR VCOMP RESISTOR\",IF(Rvcomp<0.9*C262,\"USE A LARGER VALUE FOR VCOMP RESISTOR\",\"\"))","v":""}]
["Desired Voltage Compensation Pole (fPole < 50Hz):","fPOLE",20,"Hz"]
["Recommended Value for the Parallel Voltage Compensation Capacitor:","CVCOMP_P(recommended)",{"$f":"data!F271","v":1.8},{"$f":"data!G271","v":"µF"},{"$f":"IF(fpole>50,\"POLE MUST BE < 50Hz\",\"\")","v":""}]
["Actual Value for the Parallel Voltage Compensation Capacitor:","CVCOMP_P(actual)",1.68,"mF",{"$f":"IF(Cvcomp_p<C266*0.75,\"USE LARGER PARALLEL CAPACITOR ON VCOMP\",IF(Cvcomp_p>1.25*C266,\"USE SMALLER PARALLEL CAPACITOR ON VCOMP\",\"\"))","v":""}]
[null,null,10]

{"sheet":"SCHEMATIC","index":1,"n_rows":103,"n_cols":5,"rows_kept":103,"cut":false,"hidden":false,"merged":[[37,1,37,4],[38,2,38,4],[39,3,39,4],[45,3,45,4],[52,3,52,4],[56,3,56,4],[61,3,61,4],[64,3,64,4],[66,3,66,4],[68,3,68,4],[73,3,73,4],[75,3,75,4],[77,3,77,4],[79,3,79,4],[82,3,82,4],[84,3,84,4],[86,3,86,4],[88,3,88,4],[90,3,90,4],[93,3,93,4],[96,3,96,4],[99,3,99,4],[100,3,100,4],[101,3,101,4],[39,1,41,1],[42,1,44,1],[45,1,47,1],[48,1,51,1],[52,1,55,1],[56,1,60,1],[61,1,63,1],[64,1,65,1],[66,1,67,1],[68,1,72,1],[73,1,74,1],[75,1,76,1],[77,1,78,1],[79,1,81,1],[82,1,83,1],[84,1,85,1],[86,1,87,1],[88,1,89,1],[90,1,92,1],[93,1,95,1],[96,1,98,1],[99,1,100,1],[101,1,102,1],[80,2,81,2],[91,2,92,2],[0,0,1,5]]}
["Typical Schematic for a PFC Continuous Conduction Mode Boost Converter Using the UCC28180"]
[]
[]
[]
[]
[]
[]
[]
[]
[]
[]
[]
[]
[]
[]
[]
[]
[]
[]
[]
[]
[]
[]
[]
[]
[]
[]
[]
[]
[]
[]
[]
[]
[]
[]
[]
[]
[null,"RECOMMENDED BILL OF MATERIALS"]
[null,"Reference Designator","Description/Comments"]
[null,"FUSE","Type:","Fast Acting"]
[null,null,"Voltage Rating:",{"$f":"IF(Vacin_max<270,250,350)","v":250},{"$f":"'DESIGN INPUTS AND CALCULATIONS'!D24","v":"VRMS"}]
[null,null,"Current Rating:",{"$f":"Ifuse","v":10.2037820061076},{"$f":"'DESIGN INPUTS AND CALCULATIONS'!D49","v":"A"}]
[null,"BRIDGE","DC Blocking Voltage:",{"$f":"Vrated","v":408.820856610814},{"$f":"'DESIGN INPUTS AND CALCULATIONS'!D58","v":"V"}]
[null,null,"Current Rating:",{"$f":"Ibridge","v":9.91363103590894},{"$f":"'DESIGN INPUTS AND CALCULATIONS'!D57","v":"A"}]
[null,null,"Power Dissipation:",{"$f":"Pbridge","v":12.557265978818},{"$f":"'DESIGN INPUTS AND CALCULATIONS'!D59","v":"W"}]
[null,"CIN","Type:","Film Capacitor, X2"]
[null,null,"Value:",{"$f":"IF(Cin=\"\",Cin_rcmd,Cin)","v":1},{"$f":"data!G228","v":"µF"}]
[null,null,"Volatge Rating:",{"$f":"Vacin_max","v":262.8},"VRMS"]
[null,"LBST","Inductor Value:",{"$f":"IF(Lbst=\"\",Lbst_rcmd,Lbst)","v":0.468},{"$f":"'DESIGN INPUTS AND CALCULATIONS'!D77","v":"mH"}]
[null,null,"Peak Current Rating:",{"$f":"Il_peak_actual","v":12.4244706754955},{"$f":"'DESIGN INPUTS AND CALCULATIONS'!D79","v":"A"}]
[null,null,"Ripple Current:",{"$f":"Iripple_actual","v":4.08588106245018},{"$f":"'DESIGN INPUTS AND CALCULATIONS'!D78","v":"A"}]
[null,null,"Maximum Duty Cycle:",{"$f":"Dmax","v":0.345961177322431}]
[null,"DBOOST","Type:","Diode, Low Reverse Recovery Charge, Schottky"]
[null,null,"Average Current Rating:",{"$f":"Iin_avg_max","v":6.60908735727263},{"$f":"'DESIGN INPUTS AND CALCULATIONS'!D48","v":"A"}]
[null,null,"Volatge Rating:",{"$f":"Vdiode_blocking","v":409.10294117647},{"$f":"'DESIGN INPUTS AND CALCULATIONS'!D33","v":"V"}]
[null,null,"Power Dissipation:",{"$f":"Pdiode","v":4.17406442981997},{"$f":"'DESIGN INPUTS AND CALCULATIONS'!D91","v":"W"}]
[null,"QFET","Type:","MOSFET, Nchannel"]
[null,null,"RMS Drain Current Rating:",{"$f":"Ids_rms","v":4.6532038795046},{"$f":"'DESIGN INPUTS AND CALCULATIONS'!D99","v":"A"}]
[null,null,"Peak Current Rating:",{"$f":"Il_peak_actual","v":12.4244706754955},{"$f":"'DESIGN INPUTS AND CALCULATIONS'!D79","v":"A"}]
[null,null,"Voltage Rating:",{"$f":"Vin_peak_max","v":371.655324191649},{"$f":"'DESIGN INPUTS AND CALCULATIONS'!D28","v":"V"}]
[null,null,"Power Dissipation:",{"$f":"P_FET","v":14.8732143219474},{"$f":"'DESIGN INPUTS AND CALCULATIONS'!D111","v":"W"}]
[null,"RSENSE","Type:","Resistor, Low Inductance"]
[null,null,"Value:",{"$f":"IF(Rsense=\"\",Rsense_ideal,Rsense)","v":0.019},"W"]
[null,null,"Power Dissipation:",{"$f":"P_Rsense","v":1.02387359729576},{"$f":"'DESIGN INPUTS AND CALCULATIONS'!D120","v":"W"}]
[null,"RISENSE","Type:","Resistor, Chip, 1/16W"]
[null,null,"Value:",{"$f":"Risense","v":220},"W"]
[null,"CISENSE","Type:","Capacitor, Ceramic, 100V, X7R, ±10%"]
[null,null,"Value:",{"$f":"Cisense","v":2000},{"$f":"'DESIGN INPUTS AND CALCULATIONS'!D126","v":"pF"}]
[null,"COUT","Type:","Capacitor, Aluminum, ±20% "]
[null,null,"Value:",{"$f":"IF(Cout=\"\",Cout_rcmd,Cout)","v":470},{"$f":"'DESIGN INPUTS AND CALCULATIONS'!D133","v":"µF"}]
[null,null,"Voltage Rating:",{"$f":"Vovp","v":405.383823529412},"V"]
[null,null,"2 x fLINE Ripple Current Rating:",{"$f":"Icout_2fline","v":2.28153077678222},"ARMS"]
[null,null,"HF Ripple Current Rating:",{"$f":"Icout_HF","v":3.37735177869938},"ARMS"]
[null,"RFB1","Type:","Resistor, Chip, Total Voltage Rating 400V, ±1%"]
[null,null,"Value:",{"$f":"IF(R_fb1=\"\",Rfb1_rcmd,R_fb1)","v":0.998},"MW"]
[null,"RFB2","Type:","Resistor, Chip, 1/10W, ±1%"]
[null,null,"Value:",{"$f":"IF(R_fb2=\"\",R_fb2_rcmd,R_fb2)","v":13.6},"kW"]
[null,"CVSENSE","Type:","Capacitor, Ceramic, 50V, X7R, ±10%"]
[null,null,"Value:",{"$f":"Cvsense","v":680},"pF"]
[null,"CICOMP","Type:","Capacitor, Ceramic, 50V, X7R, ±10%"]
[null,null,"Recommended Values:",{"$f":"Cicomp_minrcmd","v":3300},"pF min"]
[null,null,null,{"$f":"Cicomp_maxrcmd","v":6800},"pF min"]
[null,"CVCOMP","Type:","Capacitor, Ceramic, 10V, X5R, ±10%"]
[null,null,"Value:",{"$f":"IF(Cvcomp=\"\",Cvcomp_rcmd,Cvcomp)","v":10},"mF"]
[null,"RVCOMP","Type:","Resistor, Chip, 1/10W, ±1%"]
[null,null,"Value:",{"$f":"IF(Rvcomp=\"\",Rvcomp_rcmd,Rvcomp)","v":5.11},"kW"]
[null,"CVCOMP_P","Type:","Capacitor, Ceramic, 10V, X5R, ±10%"]
[null,null,"Value:",{"$f":"IF(Cvcomp_p=\"\",Cvcomp_p_rcmd,Cvcomp_p)","v":1.68},"mF"]
[null,"RFREQ","Type:","Resistor, Chip, 1/10W, ±1%"]
[null,null,"Value:",{"$f":"IF(Rfreq=\"\",Rfreq_rcmd,Rfreq)","v":44.2},"kΩ"]
[null,"CVCC","Type:","Ceramic, Low ESR/ESL, placed close to the VCC and GND pins with short traces"]
[null,null,"Values:",0.1,"mF min"]
[null,null,null,1,"mF max"]
[null,"DSTART","Type:","Diode, Switching"]
[null,null,"Average Current Rating:",{"$f":"Iinrush","v":3.09712770159708},"A"]
[null,null,"Volatge Rating:",{"$f":"Vovp","v":405.383823529412},"V"]
[null,"DTURNOFF","Type:","Diode, Schottky"]
[null,null,"Average Current Rating:",2,"A"]
[null,null,"Volatge Rating:",40,"V"]
[null,"RGATE","Type:","Resistor, Chip, 1/10W, ±1%"]
[null,null,"Value:","As Needed"]
[null,"RGATE2","Type:","Resistor, Chip, 1/10W, ±1%"]
[null,null,"Value:",10,"kΩ"]

{"sheet":"data","index":2,"n_rows":278,"n_cols":25,"rows_kept":278,"cut":false,"hidden":true,"merged":[[1,0,1,3],[33,6,33,7],[35,6,35,7],[35,9,35,10],[37,6,37,7],[37,9,37,10],[47,6,47,7],[47,9,47,10],[58,6,58,7],[58,9,58,10],[63,6,63,7],[63,9,63,10],[67,6,67,7],[67,9,67,10],[109,0,109,5],[109,6,109,14],[110,15,110,16],[110,17,110,19],[111,3,111,4],[111,10,111,11],[111,12,111,13],[166,0,166,3],[179,0,179,2],[231,0,231,2],[232,0,232,2],[245,0,245,2],[110,0,112,0],[110,6,112,6],[110,14,111,14]]}
[]
["Data for M1M2 vs VCOMP table"]
[]
["VCOMP","M1","M2","M1M2"]
[0,{"$f":"IF(A5<1,(0.068),IF(A5<2,(0.156*A5-0.088),IF(A5<4.5,(0.313*A5-0.401),IF(A5<=5,1.007,\"VCOMP MUST BE < 5\"))))","v":0.068},{"$f":"IF(A5<=0.5,0,IF(A5<4.6,((fSW_target/65)*0.1223*(A5-0.5)^2),IF(A5<=5,((fSW_target/65)*2.056),\"VCOMP MUST BE < 5\")))","v":0},{"$f":"B5*C5","v":0},null,null,"mV factor",{"$f":"10^-3","v":0.001}]
[{"$f":"A5+0.05","v":0.05},{"$f":"IF(A6<1,(0.068),IF(A6<2,(0.156*A6-0.088),IF(A6<4.5,(0.313*A6-0.401),IF(A6<=5,1.007,\"VCOMP MUST BE < 5\"))))","v":0.068},0,{"$f":"B6*C6","v":0},null,null,"uF factor",{"$f":"(10^-6)","v":1e-6}]
[{"$f":"A6+0.05","v":0.1},0.068,0,0,null,null,"kHz factor",{"$f":"10^3","v":1000}]
[0.15,0.068,0,0,null,null,"mΩ factor",{"$f":"10^-3","v":0.001}]
[0.2,0.068,0,0,null,null,"ms factor",{"$f":"10^-3","v":0.001}]
[0.25,0.068,0,0,null,null,"mA factor",{"$f":"10^-3","v":0.001}]
[0.3,0.068,0,0,null,null,"us factor",{"$f":"10^-6","v":1e-6}]
[0.35,0.068,0,0,null,null,"uH factor",{"$f":"10^-6","v":1e-6}]
[0.4,0.068,0,0,null,null,"ns factor",{"$f":"10^-9","v":1e-9}]
[0.45,0.068,0,0,null,null,"mW factor",{"$f":"10^-3","v":0.001}]
[0.5,0.068,0,0,null,null,"pF factor",{"$f":"10^-12","v":1e-12}]
[0.55,0.068,0.000228719815384616,1.55529474461539e-5,null,null,"MHz factor",{"$f":"10^6","v":1000000}]
[0.6,0.068,0.000914879261538461,6.22117897846154e-5,null,null,"uA factor",{"$f":"10^-6","v":1e-6}]
[0.65,0.068,0.00205847833846154,0.000139976527015385,null,null,"kΩ factor",{"$f":"10^3","v":1000}]
[0.7,0.068,0.00365951704615384,0.000248847159138461,null,null,"nC factor",{"$f":"10^-9","v":1e-9}]
[0.75,0.068,0.00571799538461538,0.000388823686153846,null,null,"nF factor",{"$f":"10^-9","v":1e-9}]
[0.8,0.068,0.00823391335384616,0.000559906108061539,null,null,"uC factor",{"$f":"10^-6","v":1e-6}]
[0.85,0.068,0.0112072709538462,0.000762094424861538,null,null,"MΩ factor",{"$f":"10^6","v":1000000}]
[0.9,0.068,0.0146380681846154,0.000995388636553846,null,null,"mH factor",{"$f":"10^-3","v":0.001}]
[0.95,0.068,0.0185263050461538,0.00125978874313846]
[1,0.068,0.0228719815384615,0.00155529474461538]
[1.05,0.0758,0.0276750976615385,0.00209777240274462]
[1.1,0.0836000000000001,0.0329356534153846,0.00275342062552616]
[1.15,0.0914000000000001,0.0386536488,0.00353294350032]
[1.2,0.0992000000000001,0.0448290838153846,0.00444704511448616]
[1.25,0.107,0.0514619584615385,0.00550642955538462]
[1.3,0.1148,0.0585522727384616,0.00672180091037539,null,null,"K1",7]
[1.35,0.1226,0.0661000266461539,0.00810386326681846,null,null,"KFQ",{"$f":"1/(fsw*kHz)","v":2.0566086031066e-5}]
[1.4,0.1304,0.0741052201846154,0.00966332071207384,null,null,"fTYP",{"$f":"65*kHz","v":65000},null,"VINnom",{"$f":"(Vacin_min+Vacin_max)/2","v":217.4}]
[1.45,0.1382,0.0825678533538462,0.0114108773335015]
[1.5,0.146,0.0914879261538462,0.0133572372184615,null,null,"M1M2",{"$f":"(Iout*(Vout_nom^2)*2.5*Rsense*K_1)/(eff*(VINnom^2)*K_FQ)*us","v":0.155290385993417},null,"M1M2",{"$f":"(Iout*(Vout_nom^2)*2.5*Rsense*K_1)/(eff*(Vacin_nom^2)*K_FQ)*us","v":0.159026994658826}]
[1.55,0.1538,0.100865438584615,0.0155131044543138]
[1.6,0.1616,{"$f":"IF(A37<=0.5,0,IF(A37<4.6,((fSW_target/65)*0.1223*(A37-0.5)^2),IF(A37<=5,((fSW_target/65)*2.056),\"VCOMP MUST BE < 5\")))","v":0.110700390646154},0.0178891831284185,null,null,"VCOMP1",{"$f":"(1*10^-9*(5*10^8*SQRT(fsw*kHz)+(1.09655978*10^10)*SQRT(ftyp)*SQRT(M1M2)))/SQRT(fsw*kHz)","v":5.49616876322226},null,"VCOMP1",{"$f":"(1*10^-9*(5*10^8*SQRT(fsw*kHz)+(1.09655978*10^10)*SQRT(ftyp)*SQRT(M1M2)))/SQRT(fsw*kHz)","v":5.49616876322226}]
[1.65,0.1694,0.120992782338462,0.0204961773281354]
[1.7,0.1772,0.131742613661538,0.0233447911408246,null,null,"a1",0.156,null,"a1",0.156]
[1.75,0.185,0.142949884615385,0.0264457286538462,null,null,"b1",0.088,null,"b1",0.088]
[1.8,0.1928,0.1546145952,0.02980969395456,null,null,"c1",0.1223,null,"c1",0.1223]
[1.85,0.2006,0.166736745415385,0.0334473911303262,null,null,"d1",0.5,null,"d1",0.5]
[1.9,0.2084,0.179316335261538,0.0373695242685046,null,null,"K1V2",{"$f":"(b_1^3/(27*a_1^3))-(d_1^3/27)+SQRT((ftyp)^2*M1M2^2/(4*a_1^2*c_1^2*(fsw*kHz)^2))+(b_1^3*(ftyp)*M1M2/(27*a_1^4*c_1*(fsw*kHz))-(d_1^3*(ftyp)*M1M2/(27*a_1*c_1*(fsw*kHz)))+(b_1*d_1^2*(ftyp)*M1M2/(9*a_1^2*c_1*(fsw*kHz)))-(b_1^2*d_1*(ftyp)*M1M2/(9*a_1^3*c_1*(fsw*kHz))))","v":5.44249589715716},null,"K1V2",{"$f":"(b_1^3/(27*a_1^3))-(d_1^3/27)+SQRT((ftyp)^2*M1M2^2/(4*a_1^2*c_1^2*(fsw*kHz)^2))+(b_1^3*(ftyp)*M1M2/(27*a_1^4*c_1*(fsw*kHz))-(d_1^3*(ftyp)*M1M2/(27*a_1*c_1*(fsw*kHz)))+(b_1*d_1^2*(ftyp)*M1M2/(9*a_1^2*c_1*(fsw*kHz)))-(b_1^2*d_1*(ftyp)*M1M2/(9*a_1^3*c_1*(fsw*kHz))))","v":5.44249589715716}]
[1.95,0.2162,0.192353364738462,0.0415867974564554,null,null,"K2V2",{"$f":"(b_1*d_1^2/(9*a_1))-(b_1^2*d_1/(9*a_1^2))+(ftyp*M1M2/(2*a_1*c_1*fsw*kHz))","v":5.43836216660164},null,"K2V2",{"$f":"(b_1*d_1^2/(9*a_1))-(b_1^2*d_1/(9*a_1^2))+(ftyp*M1M2/(2*a_1*c_1*fsw*kHz))","v":5.43836216660164}]
[2,0.225,0.205847833846154,0.0463157626153846,null,null,"K3V2",{"$f":"(d_1^2/9)+(b_1^2/(9*a_1^2))-(2*b_1*d_1/(9*a_1))","v":0.000456570969391473},null,"K3V2",{"$f":"(d_1^2/9)+(b_1^2/(9*a_1^2))-(2*b_1*d_1/(9*a_1))","v":0.000456570969391473}]
[2.05,0.24065,0.219799742584615,0.0528948080529877,null,null,"K4V2",{"$f":"((b_1*c_1*fsw*kHz)+(2*a_1*c_1*d_1*fsw*kHz))/(3*a_1*c_1*fsw*kHz)","v":0.521367521367521},null,"K4V2",{"$f":"((b_1*c_1*fsw*kHz)+(2*a_1*c_1*d_1*fsw*kHz))/(3*a_1*c_1*fsw*kHz)","v":0.521367521367521}]
[2.1,0.2563,0.234209090953846,0.0600277900114708,null,null,"VCOMP2",{"$f":"(K_1V2+K_2V2)^(1/3)+(K_3V2/(K_1V2^(1/3)))+K_4V2","v":2.73754863742817},null,"VCOMP2",{"$f":"(K_1V2+K_2V2)^(1/3)+(K_3V2/(K_1V2^(1/3)))+K_4V2","v":2.73754863742817}]
[2.15,0.27195,0.249075878953846,0.0677361852814985]
[2.2,0.2876,0.264400106584615,0.0760414706537354,null,null,"a2",0.313,null,"a2",0.313]
[2.25,0.30325,0.280181773846154,0.0849651229188462,null,null,"b2",0.401,null,"b2",0.401]
[2.3,0.3189,0.296420880738461,0.0945286188674954,null,null,"c2",0.1223,null,"c2",0.1223]
[2.35,0.33455,0.313117427261539,0.104753435290348,null,null,"d2",0.5,null,"d2",0.5]
[2.4,0.3502,0.330271413415385,0.115661048978068,null,null,"K1V3",{"$f":"(b_2^3/(27*a_2^3))-(d_2^3/27)","v":0.0732522350558588},null,"K1V3",{"$f":"(b_2^3/(27*a_2^3))-(d_2^3/27)","v":0.0732522350558588}]
[2.45,0.36585,0.3478828392,0.12727293672132,null,null,"K2V3",{"$f":"(ftyp^2*M1M2^2/(4*a_2^2*c_2^2*(fsw*kHz)^2))+(b_2^3*ftyp*M1M2/(27*a_2^4*c_2*(fsw*kHz)))-(d_2^3*ftyp*M1M2/(27*a_2*c_2*(fsw*kHz)))+(b_2*d_2^2*ftyp*M1M2/(9*a_2^2*c_2*(fsw*kHz)))-(b_2^2*d_2*ftyp*M1M2/(9*a_2^3*c_2*(fsw*kHz)))","v":7.44794105678393},null,"K2V3",{"$f":"(ftyp^2*M1M2^2/(4*a_2^2*c_2^2*(fsw*kHz)^2))+(b_2^3*ftyp*M1M2/(27*a_2^4*c_2*(fsw*kHz)))-(d_2^3*ftyp*M1M2/(27*a_2*c_2*(fsw*kHz)))+(b_2*d_2^2*ftyp*M1M2/(9*a_2^2*c_2*(fsw*kHz)))-(b_2^2*d_2*ftyp*M1M2/(9*a_2^3*c_2*(fsw*kHz)))","v":7.44794105678393}]
[2.5,0.3815,0.365951704615385,0.139610575310769,null,null,"K3V3",{"$f":"(b_2*d_2^2/(9*a_2))-(b_2^2*d_2/(9*a_2^2))+(ftyp*M1M2/(2*a_2*c_2*(fsw*kHz)))","v":2.65589648125682},null,"K3V3",{"$f":"(b_2*d_2^2/(9*a_2))-(b_2^2*d_2/(9*a_2^2))+(ftyp*M1M2/(2*a_2*c_2*(fsw*kHz)))","v":2.65589648125682}]
[2.55,0.39715,0.384478009661538,0.15269544153708,null,null,"K4V3",{"$f":"(d_2^2/9)+(b_2^2/(9*a_2^2))-(2*b_2*d_2/(9*a_2))","v":0.0677995080076351},null,"K4V3",{"$f":"(d_2^2/9)+(b_2^2/(9*a_2^2))-(2*b_2*d_2/(9*a_2))","v":0.0677995080076351}]
[2.6,0.4128,0.403461754338462,0.166549012190917,null,null,"K5V3",{"$f":"(b_2*c_2*(fsw*kHz)+2*a_2*c_2*d_2*(fsw*kHz))/(3*a_2*c_2*(fsw*kHz))","v":0.76038338658147},null,"K5V3",{"$f":"(b_2*c_2*(fsw*kHz)+2*a_2*c_2*d_2*(fsw*kHz))/(3*a_2*c_2*(fsw*kHz))","v":0.76038338658147}]
[2.65,0.42845,0.422902938646154,0.181192764062945,null,null,"VCOMP3",{"$f":"((K_1V3+SQRT(K_2V3)+K_3V3)^(1/3))+(K_4V3/((K_1V3+SQRT(K_2V3)+K_3V3)^(1/3)))+K_5V3","v":2.55958597404655},null,"VCOMP3",{"$f":"((K_1V3+SQRT(K_2V3)+K_3V3)^(1/3))+(K_4V3/((K_1V3+SQRT(K_2V3)+K_3V3)^(1/3)))+K_5V3","v":2.55958597404655}]
[2.7,0.444099999999999,0.442801562584615,0.196648173943827]
[2.75,0.459749999999999,0.463157626153846,0.21293671862423,null,null,"a3",1.007,null,"a3",1.007]
[2.8,0.475399999999999,0.483971129353846,0.230079874894818,null,null,"b3",0.1223,null,"b3",0.1223]
[2.85,0.491049999999999,0.505242072184615,0.248099119546255,null,null,"c3",0.5,null,"c3",0.5]
[2.9,0.506699999999999,0.526970454646154,0.267015929369206,null,null,"VCOMP4",{"$f":"c_3+(SQRT(ftyp)*SQRT(M1M2)/(SQRT(a_3)*SQRT(b_3)*SQRT(fsw*kHz)))","v":1.79830528012624},null,"VCOMP4",{"$f":"c_3+(SQRT(ftyp)*SQRT(M1M2)/(SQRT(a_3)*SQRT(b_3)*SQRT(fsw*kHz)))","v":1.79830528012624}]
[2.95,0.522349999999999,0.549156276738462,0.286851781154335]
[3,0.537999999999999,0.571799538461538,0.307628151692307,null,null,"a4",1.007,null,"a4",1.007]
[3.05,0.553649999999999,0.594900239815385,0.329366517773787,null,null,"b4",2.056,null,"b4",2.056]
[3.1,0.569299999999999,0.6184583808,0.352088356189439,null,null,"VCOMP5",{"$f":"(a_4*(fsw*kHz)*b_4/ftyp)","v":1.54877231220712},null,"VCOMP5",{"$f":"(a_4*(fsw*kHz)*b_4/ftyp)","v":1.54877231220712}]
[3.15,0.584949999999999,0.642473961415385,0.375815143729929]
[3.2,0.600599999999999,{"$f":"IF(A69<=0.5,0,IF(A69<4.6,((fSW_target/65)*0.1223*(A69-0.5)^2),IF(A69<=5,((fSW_target/65)*2.056),\"VCOMP MUST BE < 5\")))","v":0.666946981661539},0.400568357185919,null,null,"VCOMP =",{"$f":"IF(VCOMP1>=0.5,IF(VCOMP1<1,VCOMP1,IF(VCOMP2>=1,IF(VCOMP2<2,VCOMP2,IF(VCOMP3>=2,IF(VCOMP3<4.5,VCOMP3,IF(VCOMP4>=4.5,IF(VCOMP4<4.6,VCOMP4,VCOMP5))))))))","v":2.55958597404655},null,"VCOMP =",{"$f":"IF(VCOMP1>=0.5,IF(VCOMP1<1,VCOMP1,IF(VCOMP2>=1,IF(VCOMP2<2,VCOMP2,IF(VCOMP3>=2,IF(VCOMP3<4.5,VCOMP3,IF(VCOMP4>=4.5,IF(VCOMP4<4.6,VCOMP4,VCOMP5))))))))","v":2.55958597404655}]
[3.25,{"$f":"IF(A70<1,(0.068),IF(A70<2,(0.156*A70-0.088),IF(A70<4.5,(0.313*A70-0.401),IF(A70<=5,1.007,\"VCOMP MUST BE < 5\"))))","v":0.616249999999999},0.691877441538462,{"$f":"B70*C70","v":0.426369473348076}]
[{"$f":"A70+0.05","v":3.3},0.631899999999999,0.717265341046154,0.453239969007064]
[3.35,0.647549999999999,0.743110680184615,0.481201320953547]
[3.4,0.663199999999999,0.769413458953846,0.51027500597819]
[3.45,0.678849999999999,0.796173677353846,0.540482500871658]
[3.5,0.694499999999999,0.823391335384615,0.571845282424615]
[3.55,0.710149999999999,0.851066433046154,0.604384827427725]
[3.59999999999999,0.725799999999998,0.879198970338456,0.638122612671649]
[3.64999999999999,0.741449999999998,0.907788947261533,0.673080114947062]
[3.69999999999999,0.757099999999998,0.936836363815379,0.709278811044621]
[3.74999999999999,0.772749999999998,0.966341219999994,0.746740177754993]
[3.79999999999999,0.788399999999998,0.996303515815379,0.785485691868843]
[3.84999999999999,0.804049999999998,1.02672325126153,0.825536830176833]
[3.89999999999999,0.819699999999998,1.05760042633846,0.86691506946963]
[3.94999999999999,0.835349999999998,1.08893504104615,0.909641886537897]
[3.99999999999999,0.850999999999998,1.12072709538461,0.9537387581723]
[4.04999999999999,0.866649999999998,1.15297658935384,0.999227161163503]
[4.09999999999999,0.882299999999998,1.18568352295384,1.04612857230217]
[4.14999999999999,0.897949999999998,1.21884789618461,1.09446446837897]
[{"$f":"A88+0.05","v":4.19999999999999},0.913599999999998,1.25246970904615,1.14425632618456]
[4.24999999999999,0.929249999999998,1.28654896153845,1.19552562250961]
[4.29999999999999,0.944899999999998,1.32108565366153,1.24829383414478]
[4.34999999999999,0.960549999999998,1.35607978541538,1.30258243788074]
[4.39999999999999,0.976199999999998,1.39153135679999,1.35841291050815]
[4.44999999999999,0.991849999999997,1.42744036781538,1.41580672881768]
[4.49999999999999,1.0075,1.46380681846153,1.47478536959999]
[4.54999999999999,1.007,1.50063070873845,1.51113512369962]
[4.59999999999999,1.007,1.53791203864615,1.54867742291667]
[4.64999999999999,1.007,1.53801452307692,1.54878062473846]
[4.69999999999999,1.007,1.53801452307692,1.54878062473846]
[4.74999999999999,1.007,1.53801452307692,1.54878062473846]
[4.79999999999999,1.007,1.53801452307692,1.54878062473846]
[4.84999999999999,1.007,1.53801452307692,1.54878062473846]
[4.89999999999999,1.007,1.53801452307692,1.54878062473846]
[4.94999999999999,1.007,1.53801452307692,1.54878062473846]
[4.99999999999999,1.007,1.53801452307692,1.54878062473846]
[]
[]
[]
[]
["Data For Current Averaging Bode Plot",null,null,null,null,null,"Data For Open Loop Voltage Bode Plot",null,null,null,null,null,null,null,null,"Data for Closed Loop Voltage Bode Plot"]
["Log scale converter",null,null,null,null,null,"Log scale converter",null,null,null,null,null,null,null,"Total Open Loop Phase","EA Gain",null,"Total Closed Voltage Loop Bode Plot"]
[null,"frequency","w","Gain",null,"Phase",null,"frequency","w","Voltage Feedback Gain","PWM to Power Stage Gain",null,"Total Open Loop Gain",null,null,null,"dB",null,"dB","Phase Margin"]
[null,"Hz","rad",null,"dB","degrees",null,"Hz","rad","V/V",null,"dB",null,"dB","degrees",null,null,null,null,null,null,null,"1+sRVCOMPCVCOMP","s(CVCOMP+CVCOMP_P)","1+S(rvcompcvcompcvcomp_p/CVCOMP+CVCOMPP)"]
[1,{"$f":"10^A114","v":10},{"$f":"2*PI()*B114","v":62.8318530717959},{"$f":"IMDIV((K_1*2.5*Rsense*Vout_nom)/(K_FQ*M_1*(M_2/us)*Lbst*mH),IMPRODUCT((COMPLEX(0,C114*1)),COMPLEX(1,(C114/(2*PI()*fiavg*kHz)))))","v":"-1.03597507845172-1316.76828676073i"},{"$f":"20*LOG(IMABS(D114))","v":62.3901898558669},{"$f":"IMARGUMENT(D114)*180/(PI())","v":-90.0450777771805},-2,{"$f":"10^G114","v":0.01},{"$f":"2*PI()*H114","v":0.0628318530717959},{"$f":"(R_fb2*kOhms)/((R_fb1*MegOhm)+(R_fb2*kOhms))","v":0.0134440490312376},{"$f":"IMDIV(((M_3/us)*Vout_nom)/(M1M2/us),COMPLEX(1,(I114/(2*PI()*fPWM_PSpole))))","v":"652.056232890282-2.18202076560808i"},{"$f":"20*LOG(IMABS(K114))","v":56.2857496450405},{"$f":"IMPRODUCT(J114,K114)","v":"8.76627596610103-0.0293351941600136i"},{"$f":"20*LOG(IMABS(M114))","v":18.8563513989974},{"$f":"180/PI()*IMARGUMENT(M114)","v":-0.191732104852888},{"$f":"IMPRODUCT(gmv,IMDIV((COMPLEX(1,I114*(Rvcomp*kOhms)*(Cvcomp*uF))),IMPRODUCT((COMPLEX(0,data!I114*((Cvcomp*uF)+(Cvcomp_p*uF)))),(COMPLEX(1,I114*((Rvcomp*kOhms)*(Cvcomp*uF)*(Cvcomp_p*uF))/((Cvcomp*uF)+(Cvcomp_p*uF)))))))","v":"0.20976022923656-76.30726136635i"},{"$f":"20*LOG(IMABS(P114))","v":37.6513501608452},{"$f":"IMPRODUCT((M114),(P114))","v":"-0.399672271800484-668.936664711875i"},{"$f":"20*LOG(IMABS(R114))","v":56.5077015598427},{"$f":"(180/PI()*IMARGUMENT(R114))+180","v":89.965767264906},null,null,{"$f":"COMPLEX(1,I114*('DESIGN INPUTS AND CALCULATIONS'!C263*10^3)*('DESIGN INPUTS AND CALCULATIONS'!C261*10^-6))","v":"1+0.00321070769196877i"},{"$f":"COMPLEX(0,data!I114*(('DESIGN INPUTS AND CALCULATIONS'!C261*10^-6)+('DESIGN INPUTS AND CALCULATIONS'!C267*10^-6)))","v":"7.33876043878576E-07i"},{"$f":"COMPLEX(1,I114*(('DESIGN INPUTS AND CALCULATIONS'!C263*10^3)*('DESIGN INPUTS AND CALCULATIONS'!C261*10^-6)*('DESIGN INPUTS AND CALCULATIONS'!C267*10^-6))/(('DESIGN INPUTS AND CALCULATIONS'!C261*10^-6)+('DESIGN INPUTS AND CALCULATIONS'!C267*10^-6)))","v":"1+0.0004618141200777i"}]
[1.1,{"$f":"10^A115","v":12.5892541179417},79.1006165022013,"-1.03597470338775-1045.94585008964i",60.3901882835487,{"$f":"180/PI()*IMARGUMENT(D115)","v":-90.0567495523512},-1.9,{"$f":"10^G115","v":0.0125892541179417},{"$f":"2*PI()*H115","v":0.0791006165022012},0.0134440490312376,"652.051962165678-2.74698339905422i",56.285721200282,"8.76621855027006-0.0369305795048807i",18.856322954239,-0.241375892078809,{"$f":"IMPRODUCT(gmv,IMDIV((COMPLEX(1,I115*(Rvcomp*kOhms)*(Cvcomp*uF))),IMPRODUCT((COMPLEX(0,data!I115*((Cvcomp*uF)+(Cvcomp_p*uF)))),(COMPLEX(1,I115*((Rvcomp*kOhms)*(Cvcomp*uF)*(Cvcomp_p*uF))/((Cvcomp*uF)+(Cvcomp_p*uF)))))))","v":"0.209760203070762-60.6130572234001i"},35.6513758043441,"-0.399671545555332-531.355053186207i",54.5076987585831,89.9569036027871]
[1.2,15.8489319246111,99.5817762032062,"-1.03597410895197-830.823843997118i",58.3901857915935,-90.0714434398983,-1.8,0.0158489319246111,0.0995817762032061,0.0134440490312376,"652.045193637921-3.45821130902876i",56.2856761187596,"8.76612755385102-0.046492362398963i",18.8562778727166,-0.303873192885279,{"$f":"IMPRODUCT(gmv,IMDIV((COMPLEX(1,I116*(Rvcomp*kOhms)*(Cvcomp*uF))),IMPRODUCT((COMPLEX(0,data!I116*((Cvcomp*uF)+(Cvcomp_p*uF)))),(COMPLEX(1,I116*((Rvcomp*kOhms)*(Cvcomp*uF)*(Cvcomp_p*uF))/((Cvcomp*uF)+(Cvcomp_p*uF)))))))","v":"0.20976016160078-48.146719404209i"},33.6514164462277,"-0.399670394552828-422.07003584222i",52.5076943189443,89.945744975916]
[1.3,19.9526231496888,125.366028613816,"-1.03597316683614-659.946237212802i",56.3901818421137,-90.0899419347295,-1.7,0.0199526231496888,0.125366028613816,0.0134440490312376,"652.034466532188-4.35355847265006i",56.2856046703203,"8.76598333811559-0.0585294535666673i",18.8562064242772,-0.382551586607074,{"$f":"IMPRODUCT(gmv,IMDIV((COMPLEX(1,I117*(Rvcomp*kOhms)*(Cvcomp*uF))),IMPRODUCT((COMPLEX(0,data!I117*((Cvcomp*uF)+(Cvcomp_p*uF)))),(COMPLEX(1,I117*((Rvcomp*kOhms)*(Cvcomp*uF)*(Cvcomp_p*uF))/((Cvcomp*uF)+(Cvcomp_p*uF)))))))","v":"0.209760095875323-38.2443699611565i"},31.6514808584603,"-0.399668570383345-335.261787000018i",50.5076872827375,89.9316972219103]
[1.4,25.1188643150958,157.826479197648,"-1.03597167368671-524.213174067972i",54.3901755826172,-90.1132301328173,-1.6,0.0251188643150958,0.157826479197647,0.0134440490312376,"652.017465938305-5.48066249107778i",56.2854914345828,"8.76575478129786-0.0736822952537145i",18.8560931885398,-0.481599727989242,{"$f":"IMPRODUCT(gmv,IMDIV((COMPLEX(1,I118*(Rvcomp*kOhms)*(Cvcomp*uF))),IMPRODUCT((COMPLEX(0,data!I118*((Cvcomp*uF)+(Cvcomp_p*uF)))),(COMPLEX(1,I118*((Rvcomp*kOhms)*(Cvcomp*uF)*(Cvcomp_p*uF))/((Cvcomp*uF)+(Cvcomp_p*uF)))))))","v":"0.209759991707575-30.3786726772635i"},29.6515829429298,"-0.399665679386404-266.307450867847i",48.5076761314696,89.9140123966547]
[1.5,31.6227766016838,198.691765315922,"-1.03596930721314-416.396373998819i",52.3901656620025,-90.1425481830432,-1.5,0.0316227766016838,0.198691765315922,0.0134440490312376,"651.990523628652-6.89946017597837i",56.2853119740809,"8.76539256756588-0.0927566808949244i",18.8559137280379,-0.606289784621955,{"$f":"IMPRODUCT(gmv,IMDIV((COMPLEX(1,I119*(Rvcomp*kOhms)*(Cvcomp*uF))),IMPRODUCT((COMPLEX(0,data!I119*((Cvcomp*uF)+(Cvcomp_p*uF)))),(COMPLEX(1,I119*((Rvcomp*kOhms)*(Cvcomp*uF)*(Cvcomp_p*uF))/((Cvcomp*uF)+(Cvcomp_p*uF)))))))","v":"0.209759826613034-24.1307504896798i"},27.6517447307877,"-0.399661097758474-211.534957617328i",46.5076584588256,89.8917490179945]
[1.6,39.8107170553498,250.138112470457,"-1.03596555662743-330.754199249231i",50.3901499389341,-90.1794573134705,-1.4,0.0398107170553497,0.250138112470457,0.0134440490312376,"651.94782750612-8.68533693969473i",56.2850275635426,"8.76481855880111-0.116766095670075i",18.8556293174995,-0.763256954891536,{"$f":"IMPRODUCT(gmv,IMDIV((COMPLEX(1,I120*(Rvcomp*kOhms)*(Cvcomp*uF))),IMPRODUCT((COMPLEX(0,data!I120*((Cvcomp*uF)+(Cvcomp_p*uF)))),(COMPLEX(1,I120*((Rvcomp*kOhms)*(Cvcomp*uF)*(Cvcomp_p*uF))/((Cvcomp*uF)+(Cvcomp_p*uF)))))))","v":"0.209759564956352-19.167878758609i"},25.6520011343955,"-0.399653837104656-168.027472281735i",44.507630451895,89.8637220768694]
[1.7,50.1187233627272,314.905226247286,"-1.0359596124053-262.725891725062i",48.3901250196667,-90.2259229401534,-1.3,0.0501187233627272,0.314905226247286,0.0134440490312376,"651.880170165541-10.9330566632665i",56.2845768413652,"8.76390897019704-0.146984549842254i",18.8551785953222,-0.960850334796114,{"$f":"IMPRODUCT(gmv,IMDIV((COMPLEX(1,I121*(Rvcomp*kOhms)*(Cvcomp*uF))),IMPRODUCT((COMPLEX(0,data!I121*((Cvcomp*uF)+(Cvcomp_p*uF)))),(COMPLEX(1,I121*((Rvcomp*kOhms)*(Cvcomp*uF)*(Cvcomp_p*uF))/((Cvcomp*uF)+(Cvcomp_p*uF)))))))","v":"0.209759150259797-15.2257664668799i"},23.6524074744122,"-0.399642331594885-133.46806267149i",42.5075860697343,89.8284402273854]
[1.8,63.0957344480194,396.4421916295,"-1.03595019158785-208.688695998211i",46.3900855255823,-90.2844192683075,-1.2,0.0630957344480193,0.3964421916295,0.0134440490312376,"651.772969266991-13.7616394049411i",56.2838625906586,"8.76246775606075-0.18501215491024i",18.8544643446156,-1.20957258867656,{"$f":"IMPRODUCT(gmv,IMDIV((COMPLEX(1,I122*(Rvcomp*kOhms)*(Cvcomp*uF))),IMPRODUCT((COMPLEX(0,data!I122*((Cvcomp*uF)+(Cvcomp_p*uF)))),(COMPLEX(1,I122*((Rvcomp*kOhms)*(Cvcomp*uF)*(Cvcomp_p*uF))/((Cvcomp*uF)+(Cvcomp_p*uF)))))))","v":"0.209758493013407-12.0944817593978i"},21.6530513987815,"-0.399624101238905-106.016314313791i",40.5075157433971,89.7840269575823]
[1.9,79.4328234724282,499.091149349751,"-1.03593526094936-165.764934376606i",44.3900229324124,-90.3580609242672,-1.1,0.0794328234724281,0.49909114934975,0.0134440490312376,"651.603139496195-17.3203632835667i",56.2827308201399,"8.7601845562952-0.232855813223118i",18.8533325740968,-1.5226293877566,{"$f":"IMPRODUCT(gmv,IMDIV((COMPLEX(1,I123*(Rvcomp*kOhms)*(Cvcomp*uF))),IMPRODUCT((COMPLEX(0,data!I123*((Cvcomp*uF)+(Cvcomp_p*uF)))),(COMPLEX(1,I123*((Rvcomp*kOhms)*(Cvcomp*uF)*(Cvcomp_p*uF))/((Cvcomp*uF)+(Cvcomp_p*uF)))))))","v":"0.209757451356515-9.60727230605458i"},19.6540717463399,"-0.399595219741095-84.2103217255371i",38.5074043204367,89.7281218347697]
[2,100,628.318530717959,"-1.03591159836363-131.668760087496i",42.3899237307715,-90.4507685643392,-1,0.1,0.628318530717959,0.0134440490312376,"651.334158663771-21.7960443879901i",56.2809376886809,"8.75656836479563-0.29302708943917i",18.8515394426379,-1.91661299926195,{"$f":"IMPRODUCT(gmv,IMDIV((COMPLEX(1,I124*(Rvcomp*kOhms)*(Cvcomp*uF))),IMPRODUCT((COMPLEX(0,data!I124*((Cvcomp*uF)+(Cvcomp_p*uF)))),(COMPLEX(1,I124*((Rvcomp*kOhms)*(Cvcomp*uF)*(Cvcomp_p*uF))/((Cvcomp*uF)+(Cvcomp_p*uF)))))))","v":"0.20975580046279-7.63168513151565i"},17.6556883766025,"-0.399549474939369-66.8888367244137i",36.5072278192404,89.6577571464266]
[2.1,125.892541179417,791.006165022012,"-1.03587409790679-104.58442762916i",40.3897665114075,-90.5674771526052,-0.9,0.125892541179417,0.791006165022012,0.0134440490312376,"650.908307361658-27.4216537695908i",56.2780972825041,"8.75084319901-0.368658057796i",18.848699036461,-2.41234673672927,{"$f":"IMPRODUCT(gmv,IMDIV((COMPLEX(1,I125*(Rvcomp*kOhms)*(Cvcomp*uF))),IMPRODUCT((COMPLEX(0,data!I125*((Cvcomp*uF)+(Cvcomp_p*uF)))),(COMPLEX(1,I125*((Rvcomp*kOhms)*(Cvcomp*uF)*(Cvcomp_p*uF))/((Cvcomp*uF)+(Cvcomp_p*uF)))))))","v":"0.209753184025794-6.06251301015483i"},15.6582492787747,"-0.399477047783849-53.1294279452625i",34.5069483152358,89.5692045176616]
[2.2,158.489319246112,995.817762032063,"-1.03581466924923-83.0695977571142i",38.3895173471656,-90.7143977454787,-0.8,0.158489319246111,0.995817762032061,0.0134440490312376,"650.23451800723-34.4860814194137i",56.2735993439374,"8.74178474189235-0.46363256949785i",18.8442010978944,-3.0359160198329,{"$f":"IMPRODUCT(gmv,IMDIV((COMPLEX(1,I126*(Rvcomp*kOhms)*(Cvcomp*uF))),IMPRODUCT((COMPLEX(0,data!I126*((Cvcomp*uF)+(Cvcomp_p*uF)))),(COMPLEX(1,I126*((Rvcomp*kOhms)*(Cvcomp*uF)*(Cvcomp_p*uF))/((Cvcomp*uF)+(Cvcomp_p*uF)))))))","v":"0.209749037386312-4.81619179538308i"},13.6623048137781,"-0.399362442637651-42.19935843606i",32.5065059116724,89.45778561019]
[2.3,199.526231496888,1253.66028613816,"-1.03572049514094-65.978527770165i",36.3891224777345,-90.8993462179688,-0.7,0.199526231496888,1.25366028613816,0.0134440490312376,"649.169486566306-43.344293338627i",56.266480120358,"8.72746640698076-0.582722804868847i",18.837081874315,-3.81990297109056,{"$f":"IMPRODUCT(gmv,IMDIV((COMPLEX(1,I127*(Rvcomp*kOhms)*(Cvcomp*uF))),IMPRODUCT((COMPLEX(0,data!I127*((Cvcomp*uF)+(Cvcomp_p*uF)))),(COMPLEX(1,I127*((Rvcomp*kOhms)*(Cvcomp*uF)*(Cvcomp_p*uF))/((Cvcomp*uF)+(Cvcomp_p*uF)))))))","v":"0.209742465741452-3.82635031960205i"},11.6687243282924,"-0.39918126677348-33.5165655936039i",30.5058062026074,89.317641288189]
[2.4,251.188643150958,1578.26479197648,"-1.03557127430985-52.4010567535798i",34.3884967253938,-91.132155428724,-0.6,0.251188643150958,1.57826479197648,0.0134440490312376,"647.488653548413-54.4259465778949i",56.2552207623058,"8.70486920547488-0.731705094364737i",18.8258225162628,-4.80481568112112,{"$f":"IMPRODUCT(gmv,IMDIV((COMPLEX(1,I128*(Rvcomp*kOhms)*(Cvcomp*uF))),IMPRODUCT((COMPLEX(0,data!I128*((Cvcomp*uF)+(Cvcomp_p*uF)))),(COMPLEX(1,I128*((Rvcomp*kOhms)*(Cvcomp*uF)*(Cvcomp_p*uF))/((Cvcomp*uF)+(Cvcomp_p*uF)))))))","v":"0.209732051229718-3.04027587848552i"},9.67887835442322,"-0.398895274411429-26.618665881113i",28.504700870686,89.1414556537336]
[2.5,316.227766016838,1986.91765315922,"-1.03533486328664-41.6141366298631i",32.3875051594178,-91.4251907630381,-0.5,0.316227766016838,1.98691765315922,0.0134440490312376,"644.842469148705-68.2381840599429i",56.2374354614828,"8.66929377265951-0.917397492304488i",18.8080372154398,-6.04064301123036,{"$f":"IMPRODUCT(gmv,IMDIV((COMPLEX(1,I129*(Rvcomp*kOhms)*(Cvcomp*uF))),IMPRODUCT((COMPLEX(0,data!I129*((Cvcomp*uF)+(Cvcomp_p*uF)))),(COMPLEX(1,I129*((Rvcomp*kOhms)*(Cvcomp*uF)*(Cvcomp_p*uF))/((Cvcomp*uF)+(Cvcomp_p*uF)))))))","v":"0.209715547459329-2.41610706926546i"},7.6949208733619,"-0.398444876864238-21.1383344869981i",26.5029580888016,88.9201369357971]
[2.6,398.107170553498,2501.38112470457,"-1.03496039809011-33.0433280850928i",30.385934096842,-91.7939925062209,-0.4,0.398107170553497,2.50138112470457,0.0134440490312376,"640.692569169735-85.3539286921787i",56.2093960091439,"8.6135023138675-1.14750240234641i",18.7799977631009,-7.58833914960988,{"$f":"IMPRODUCT(gmv,IMDIV((COMPLEX(1,I130*(Rvcomp*kOhms)*(Cvcomp*uF))),IMPRODUCT((COMPLEX(0,data!I130*((Cvcomp*uF)+(Cvcomp_p*uF)))),(COMPLEX(1,I130*((Rvcomp*kOhms)*(Cvcomp*uF)*(Cvcomp_p*uF))/((Cvcomp*uF)+(Cvcomp_p*uF)))))))","v":"0.209689396065726-1.92060448251325i"},5.72022065326561,"-0.397738159435628-16.7837502398842i",24.5002184163665,88.6424694687273]
[2.7,501.187233627273,3149.05226247286,"-1.03436746529305-26.2322113175381i",28.3834452940427,-92.258071297747,-0.3,0.501187233627272,3.14905226247286,0.0134440490312376,"634.223728068896-106.369303339976i",56.1653240004974,"8.52653489693254-1.43003412952122i",18.7359257544544,-9.52079531676898,{"$f":"IMPRODUCT(gmv,IMDIV((COMPLEX(1,I131*(Rvcomp*kOhms)*(Cvcomp*uF))),IMPRODUCT((COMPLEX(0,data!I131*((Cvcomp*uF)+(Cvcomp_p*uF)))),(COMPLEX(1,I131*((Rvcomp*kOhms)*(Cvcomp*uF)*(Cvcomp_p*uF))/((Cvcomp*uF)+(Cvcomp_p*uF)))))))","v":"0.20964796225724-1.52738051087782i"},3.76000585882152,"-0.396635593063687-13.3230669681068i",22.4959316132759,88.294774370225]
[2.8,630.957344480193,3964.421916295,"-1.03342912052627-20.8180834677627i",26.3795037266265,-92.8418832332148,-0.2,0.630957344480193,3.964421916295,0.0134440490312376,"624.234666734211-131.801912517498i",56.0963779734058,"8.392241466573-1.77195137429613i",18.6669797273627,-11.9224114265444,{"$f":"IMPRODUCT(gmv,IMDIV((COMPLEX(1,I132*(Rvcomp*kOhms)*(Cvcomp*uF))),IMPRODUCT((COMPLEX(0,data!I132*((Cvcomp*uF)+(Cvcomp_p*uF)))),(COMPLEX(1,I132*((Rvcomp*kOhms)*(Cvcomp*uF)*(Cvcomp_p*uF))/((Cvcomp*uF)+(Cvcomp_p*uF)))))))","v":"0.209582327626721-1.21549397033992i"},1.82229237024331,"-0.394930710622625-10.5720885937225i",20.4892720976061,87.8606548717628]
[2.9,794.328234724282,4990.91149349751,"-1.03194542661307-16.5126501984294i",24.3732640817053,-93.5760052968737,-0.1,0.794328234724281,4.9909114934975,0.0134440490312376,"609.03191357487-161.887709788485i",55.9892996436927,"8.18785490768901-2.17642630795116i",18.5599013976496,-14.8856649946663,{"$f":"IMPRODUCT(gmv,IMDIV((COMPLEX(1,I133*(Rvcomp*kOhms)*(Cvcomp*uF))),IMPRODUCT((COMPLEX(0,data!I133*((Cvcomp*uF)+(Cvcomp_p*uF)))),(COMPLEX(1,I133*((Rvcomp*kOhms)*(Cvcomp*uF)*(Cvcomp_p*uF))/((Cvcomp*uF)+(Cvcomp_p*uF)))))))","v":"0.209478387887642-0.968334622350206i"},-0.0808618513690473,"-0.392330300662328-8.38449766424118i",18.4790395462806,87.3209503041333]
[3,1000,6283.18530717959,"-1.02960263712829-13.0866864342135i",22.363393237543,-94.4985122188051,0,1,6.28318530717959,0.0134440490312376,"586.397639314965-196.23028833222i",55.8248212717297,"7.88355861475237-2.63812961775226i",18.3954230256867,-18.5021425088586,{"$f":"IMPRODUCT(gmv,IMDIV((COMPLEX(1,I134*(Rvcomp*kOhms)*(Cvcomp*uF))),IMPRODUCT((COMPLEX(0,data!I134*((Cvcomp*uF)+(Cvcomp_p*uF)))),(COMPLEX(1,I134*((Rvcomp*kOhms)*(Cvcomp*uF)*(Cvcomp_p*uF))/((Cvcomp*uF)+(Cvcomp_p*uF)))))))","v":"0.209313865516114-0.772738054823482i"},-1.93185066238196,"-0.388445021517418-6.64412285707492i",16.4635723633047,86.6540422750244]
[3.1,1258.92541179417,7910.06165022013,"-1.02591127765911-10.3578556495514i",20.3477948145887,-95.6565079887709,0.1,1.25892541179417,7.91006165022012,0.0134440490312376,"553.77920103583-233.297706356784i",55.5762655427922,"7.44503473120528-3.13646580313588i",18.1468672967492,-22.8448597671229,{"$f":"IMPRODUCT(gmv,IMDIV((COMPLEX(1,I135*(Rvcomp*kOhms)*(Cvcomp*uF))),IMPRODUCT((COMPLEX(0,data!I135*((Cvcomp*uF)+(Cvcomp_p*uF)))),(COMPLEX(1,I135*((Rvcomp*kOhms)*(Cvcomp*uF)*(Cvcomp_p*uF))/((Cvcomp*uF)+(Cvcomp_p*uF)))))))","v":"0.209053643834019-0.618283512710478i"},-3.70612903144,"-0.382813455229852-5.25883183076746i",14.4407382653092,85.8365324214546]
[3.2,1584.89319246112,9958.17762032063,"-1.02011477909442-8.1810508077552i",18.3231871702458,-97.1076620957695,0.2,1.58489319246111,9.95817762032062,0.0134440490312376,"508.913455940759-269.909246448419i",55.2093384789424,"6.84185745432414-3.62867314323694i",17.7799402328994,-27.9398579054083,{"$f":"IMPRODUCT(gmv,IMDIV((COMPLEX(1,I136*(Rvcomp*kOhms)*(Cvcomp*uF))),IMPRODUCT((COMPLEX(0,data!I136*((Cvcomp*uF)+(Cvcomp_p*uF)))),(COMPLEX(1,I136*((Rvcomp*kOhms)*(Cvcomp*uF)*(Cvcomp_p*uF))/((Cvcomp*uF)+(Cvcomp_p*uF)))))))","v":"0.208642543008246-0.496736750095686i"},-5.37184217667474,"-0.374992766160902-4.1556976288296i",12.4080980562247,84.843833030669]
[3.3,1995.26231496888,12536.6028613816,"-1.01106092988506-6.44076388878181i",16.2844700590068,-98.9213952844942,0.3,1.99526231496888,12.5366028613816,0.0134440490312376,"451.002918380606-301.129415282047i",54.6846926604305,"6.06330534794012-4.04839862379975i",17.2552944143875,-33.7305766580844,{"$f":"IMPRODUCT(gmv,IMDIV((COMPLEX(1,I137*(Rvcomp*kOhms)*(Cvcomp*uF))),IMPRODUCT((COMPLEX(0,data!I137*((Cvcomp*uF)+(Cvcomp_p*uF)))),(COMPLEX(1,I137*((Rvcomp*kOhms)*(Cvcomp*uF)*(Cvcomp_p*uF))/((Cvcomp*uF)+(Cvcomp_p*uF)))))))","v":"0.207994293751066-0.401607199455188i"},-6.89200582223292,"-0.364733119940588-3.27711089280791i",10.3632885921546,83.6492789174048]
[3.4,2511.88643150958,15782.6479197648,"-0.997036179656418-5.04511381607867i",14.2238059542568,-101.178980677646,0.4,2.51188643150958,15.7826479197648,0.0134440490312376,"382.092864465912-321.17575675265i",53.9645884126519,"5.13687520436574-4.31790262142747i",16.5351901666089,-40.0493980403808,{"$f":"IMPRODUCT(gmv,IMDIV((COMPLEX(1,I138*(Rvcomp*kOhms)*(Cvcomp*uF))),IMPRODUCT((COMPLEX(0,data!I138*((Cvcomp*uF)+(Cvcomp_p*uF)))),(COMPLEX(1,I138*((Rvcomp*kOhms)*(Cvcomp*uF)*(Cvcomp_p*uF))/((Cvcomp*uF)+(Cvcomp_p*uF)))))))","v":"0.206975098810788-0.327793914583348i"},-8.2307701861358,"-0.352176950065125-2.57753475369049i",8.30441998047306,82.2196688199377]
[3.5,3162.27766016838,19869.1765315922,"-0.975588298733152-3.92126897273593i",12.1293626021297,-103.97119241376,0.5,3.16227766016838,19.8691765315922,0.0134440490312376,"307.603466681946-325.510539103135i",53.022811395364,"4.13543608825074-4.37617964788713i",15.5934131493209,-46.6201287573216,{"$f":"IMPRODUCT(gmv,IMDIV((COMPLEX(1,I139*(Rvcomp*kOhms)*(Cvcomp*uF))),IMPRODUCT((COMPLEX(0,data!I139*((Cvcomp*uF)+(Cvcomp_p*uF)))),(COMPLEX(1,I139*((Rvcomp*kOhms)*(Cvcomp*uF)*(Cvcomp_p*uF))/((Cvcomp*uF)+(Cvcomp_p*uF)))))))","v":"0.205380086020511-0.271297830508187i"},-9.36353354216659,"-0.337911824848598-2.02071499147196i",6.22987960715435,80.5066168424501]
[3.6,3981.07170553498,25013.8112470457,"-0.94342354843773-3.01208180445918i",9.98376389800103,-107.3912408719,0.6,3.98107170553497,25.0138112470457,0.0134440490312376,"234.995396950376-313.064039126992i",51.8534926936255,"3.159289638716-4.20884829194057i",14.4240944475825,-53.1069916132942,{"$f":"IMPRODUCT(gmv,IMDIV((COMPLEX(1,I140*(Rvcomp*kOhms)*(Cvcomp*uF))),IMPRODUCT((COMPLEX(0,data!I140*((Cvcomp*uF)+(Cvcomp_p*uF)))),(COMPLEX(1,I140*((Rvcomp*kOhms)*(Cvcomp*uF)*(Cvcomp_p*uF))/((Cvcomp*uF)+(Cvcomp_p*uF)))))))","v":"0.202901909682544-0.228978754142671i"},-10.2872204103406,"-0.32271093732831-1.57739356144789i",4.1368740372418,78.4376987644748]
[3.7,5011.87233627273,31490.5226247287,"-0.896574580998489-2.27376968629059i",7.76256099412153,-111.519910737343,0.7,5.01187233627272,31.4905226247286,0.0134440490312376,"171.017043396118-286.822503798399i",50.4732930781807,"2.2991615165947-3.85605580432801i",13.0438948321376,-59.1946184297705,{"$f":"IMPRODUCT(gmv,IMDIV((COMPLEX(1,I141*(Rvcomp*kOhms)*(Cvcomp*uF))),IMPRODUCT((COMPLEX(0,data!I141*((Cvcomp*uF)+(Cvcomp_p*uF)))),(COMPLEX(1,I141*((Rvcomp*kOhms)*(Cvcomp*uF)*(Cvcomp_p*uF))/((Cvcomp*uF)+(Cvcomp_p*uF)))))))","v":"0.199094469656812-0.198334288104947i"},-11.0250982823415,"-0.307037740042571-1.22372194796186i",2.01879654979616,75.9149738949365]
[3.8,6309.57344480194,39644.21916295,"-0.831159527821745-1.67434302764836i",5.43354065182328,-116.400231464277,0.8,6.30957344480193,39.64421916295,0.0134440490312376,"119.467611365692-252.245837999892i",48.9154009439342,"1.6061284248452-3.39120541399616i",11.4860026978912,-64.6570260288727,{"$f":"IMPRODUCT(gmv,IMDIV((COMPLEX(1,I142*(Rvcomp*kOhms)*(Cvcomp*uF))),IMPRODUCT((COMPLEX(0,data!I142*((Cvcomp*uF)+(Cvcomp_p*uF)))),(COMPLEX(1,I142*((Rvcomp*kOhms)*(Cvcomp*uF)*(Cvcomp_p*uF))/((Cvcomp*uF)+(Cvcomp_p*uF)))))))","v":"0.193344330201972-0.177276345299141i"},-11.6235517895289,"-0.290644677431856-0.940398916584012i",-0.137549091637734,72.8254354990671]
[3.9,7943.28234724282,49909.114934975,"-0.745009915086631-1.19212584356942i",2.95831730161207,-122.003007499121,0.9,7.94328234724282,49.9091149349751,0.0134440490312376,"80.8452394033202-214.895974456951i",47.2194436532527,"1.08688736248038-2.88907201721483i",9.79004540720972,-69.3833794004154,{"$f":"IMPRODUCT(gmv,IMDIV((COMPLEX(1,I143*(Rvcomp*kOhms)*(Cvcomp*uF))),IMPRODUCT((COMPLEX(0,data!I143*((Cvcomp*uF)+(Cvcomp_p*uF)))),(COMPLEX(1,I143*((Rvcomp*kOhms)*(Cvcomp*uF)*(Cvcomp_p*uF))/((Cvcomp*uF)+(Cvcomp_p*uF)))))))","v":"0.184881555719696-0.163885498367335i"},-12.1438799217234,"-0.272531580892924-0.712261206198173i",-2.35383451451371,69.0617148228211]
[4,10000,62831.8530717959,"-0.639892232016167-0.81333018099498i",0.297765155701447,-128.19410415469,1,10,62.8318530717959,0.0134440490312376,"53.455781165302-178.882769094114i",45.4228459429739,"0.718662142989428-2.40490871854482i",7.99344769693086,-73.3622049943343,{"$f":"IMPRODUCT(gmv,IMDIV((COMPLEX(1,I144*(Rvcomp*kOhms)*(Cvcomp*uF))),IMPRODUCT((COMPLEX(0,data!I144*((Cvcomp*uF)+(Cvcomp_p*uF)))),(COMPLEX(1,I144*((Rvcomp*kOhms)*(Cvcomp*uF)*(Cvcomp_p*uF))/((Cvcomp*uF)+(Cvcomp_p*uF)))))))","v":"0.172888045965023-0.156149305315404i"},-12.6541711598657,"-0.251276732137254-0.52799856345774i",-4.66072346293486,64.5500271309915]
[4.1,12589.2541179417,79100.6165022012,"-0.522949446363773-0.527982779349913i",-2.57870614950084,-134.725589790748,1.1,12.5892541179417,79.1006165022013,0.0134440490312376,"34.7805653965098-146.524573649939i",43.556265515541,"0.467591626524844-1.96988355243096i",6.126867269498,-76.6468223825254,{"$f":"IMPRODUCT(gmv,IMDIV((COMPLEX(1,I145*(Rvcomp*kOhms)*(Cvcomp*uF))),IMPRODUCT((COMPLEX(0,data!I145*((Cvcomp*uF)+(Cvcomp_p*uF)))),(COMPLEX(1,I145*((Rvcomp*kOhms)*(Cvcomp*uF)*(Cvcomp_p*uF))/((Cvcomp*uF)+(Cvcomp_p*uF)))))))","v":"0.156769889814082-0.151757308030593i"},-13.2232846543928,"-0.225639937282377-0.379778873960231i",-7.09641738489483,59.2839691879928]
[4.2,15848.9319246111,{"$f":"2*PI()*B146","v":99581.7762032062},{"$f":"IMDIV((K_1*2.5*Rsense*Vout_nom)/(K_FQ*M_1*(M_2/us)*Lbst*mH),IMPRODUCT((COMPLEX(0,C146*1)),COMPLEX(1,(C146/(2*PI()*fiavg*kHz)))))","v":"-0.405498640859204-0.325199188496195i"},{"$f":"20*LOG(IMABS(D146))","v":-5.68340919613287},{"$f":"180/PI()*IMARGUMENT(D146)","v":-141.271308919029},1.2,15.8489319246111,99.5817762032062,{"$f":"(R_fb2*kOhms)/((R_fb1*MegOhm)+(R_fb2*kOhms))","v":0.0134440490312376},{"$f":"IMDIV(((M_3/us)*Vout_nom)/(M1M2/us),COMPLEX(1,(I146/(2*PI()*fPWM_PSpole))))","v":"22.3857034481101-118.725655184887i"},{"$f":"20*LOG(IMABS(K146))","v":41.6426066009262},{"$f":"IMPRODUCT(J146,K146)","v":"0.300954494755137-1.59615352957143i"},{"$f":"20*LOG(IMABS(M146))","v":4.21320835488323},{"$f":"180/PI()*IMARGUMENT(M146)","v":-79.32224719402},{"$f":"IMPRODUCT(gmv,IMDIV((COMPLEX(1,I146*(Rvcomp*kOhms)*(Cvcomp*uF))),IMPRODUCT((COMPLEX(0,data!I146*((Cvcomp*uF)+(Cvcomp_p*uF)))),(COMPLEX(1,I146*((Rvcomp*kOhms)*(Cvcomp*uF)*(Cvcomp_p*uF))/((Cvcomp*uF)+(Cvcomp_p*uF)))))))","v":"0.136587955131379-0.148118849047889i"},{"$f":"20*LOG(IMABS(P146))","v":-13.9152250175447},{"$f":"IMPRODUCT((M146),(P146))","v":"-0.195313664677644-0.262592380058815i"},{"$f":"20*LOG(IMABS(R146))","v":-9.70201666266149},{"$f":"(180/PI()*IMARGUMENT(R146))+180","v":53.3584872954132}]
[4.3,19952.6231496888,125366.028613816,"-0.299050003960682-0.190503896404047i",-9.00586510004868,-147.50163099504,1.3,19.9526231496888,125.366028613816,0.0134440490312376,"14.3056688061291-95.5172906258849i",39.6979808026557,"0.192326112854246-1.28413913850537i",2.26858255661271,-81.4820969477346,{"$f":"IMPRODUCT(gmv,IMDIV((COMPLEX(1,I147*(Rvcomp*kOhms)*(Cvcomp*uF))),IMPRODUCT((COMPLEX(0,data!I147*((Cvcomp*uF)+(Cvcomp_p*uF)))),(COMPLEX(1,I147*((Rvcomp*kOhms)*(Cvcomp*uF)*(Cvcomp_p*uF))/((Cvcomp*uF)+(Cvcomp_p*uF)))))))","v":"0.113442048209741-0.14277425278451i"},-14.7816152013372,"-0.161524137805045-0.173134591112056i",-12.5130326447245,46.9869891632788]
[4.4,25118.8643150959,157826.479197648,"-0.211185309075724-0.106862112159053i",-12.5166661891422,-153.160082958353,1.4,25.1188643150958,157.826479197648,0.0134440490312376,"9.09994407381844-76.491389819612i",37.7332863714792,"0.122340094309935-1.02835399520237i",0.303888125436131,-83.2155852939428,{"$f":"IMPRODUCT(gmv,IMDIV((COMPLEX(1,I148*(Rvcomp*kOhms)*(Cvcomp*uF))),IMPRODUCT((COMPLEX(0,data!I148*((Cvcomp*uF)+(Cvcomp_p*uF)))),(COMPLEX(1,I148*((Rvcomp*kOhms)*(Cvcomp*uF)*(Cvcomp_p*uF))/((Cvcomp*uF)+(Cvcomp_p*uF)))))))","v":"0.0894249512585318-0.13411357464074i"},-15.8530614679556,"-0.126975973322046-0.108367973267279i",-15.5491733425194,40.479185105838]
[4.5,31622.7766016838,198691.765315922,"-0.14408870595998-0.0579148573979653i",-16.1770038146525,-158.102886182447,1.5,31.6227766016838,198.691765315922,0.0134440490312376,"5.77140050231041-61.073813931676i",35.755711268104,"0.0775909913319705-0.821079349022134i",-1.67368697793902,-84.6016501487501,{"$f":"IMPRODUCT(gmv,IMDIV((COMPLEX(1,I149*(Rvcomp*kOhms)*(Cvcomp*uF))),IMPRODUCT((COMPLEX(0,data!I149*((Cvcomp*uF)+(Cvcomp_p*uF)))),(COMPLEX(1,I149*((Rvcomp*kOhms)*(Cvcomp*uF)*(Cvcomp_p*uF))/((Cvcomp*uF)+(Cvcomp_p*uF)))))))","v":"0.0669578147693538-0.121914597333599i"},-17.1339718820185,"-0.0949062349895904-0.0644371534277176i",-18.8076588599575,34.174777346112]
[4.6,39810.7170553497,250138.112470457,"-0.0958327605329252-0.0305966619924126i",-19.948163240055,-162.293203113212,1.6,39.8107170553498,250.138112470457,0.0134440490312376,"3.65344109360673-48.6716352881832i",33.7699202326796,"0.0491170411951872-0.654343851244849i",-3.65947801336345,-85.7072547465474,{"$f":"IMPRODUCT(gmv,IMDIV((COMPLEX(1,I150*(Rvcomp*kOhms)*(Cvcomp*uF))),IMPRODUCT((COMPLEX(0,data!I150*((Cvcomp*uF)+(Cvcomp_p*uF)))),(COMPLEX(1,I150*((Rvcomp*kOhms)*(Cvcomp*uF)*(Cvcomp_p*uF))/((Cvcomp*uF)+(Cvcomp_p*uF)))))))","v":"0.0478889660902661-0.107212081669435i"},-18.605055437193,"-0.0678014020993049-0.0366017907356181i",-22.2645334505565,28.361870840814]
[4.7,50118.7233627273,314905.226247286,"-0.0626035587286973-0.0158766573476461i",-23.7973130091895,-165.769450452996,1.7,50.1187233627272,314.905226247286,0.0134440490312376,"2.30994177081201-38.7413598771084i",31.7789094619526,"0.0310549704261005-0.520840741724666i",-5.65048878409043,-86.5877963690456,{"$f":"IMPRODUCT(gmv,IMDIV((COMPLEX(1,I151*(Rvcomp*kOhms)*(Cvcomp*uF))),IMPRODUCT((COMPLEX(0,data!I151*((Cvcomp*uF)+(Cvcomp_p*uF)))),(COMPLEX(1,I151*((Rvcomp*kOhms)*(Cvcomp*uF)*(Cvcomp_p*uF))/((Cvcomp*uF)+(Cvcomp_p*uF)))))))","v":"0.0329959221446715-0.0915961051804338i"},-20.2325684093431,"-0.046682295974883-0.0200301349012444i",-25.8830571934335,23.2228876249663]
[4.8,63095.7344480193,396442.1916295,"-0.0404011650237929-0.00813867936324325i",-27.6993643372821,-168.610390745502,1.8,63.0957344480194,396.4421916295,0.0134440490312376,"1.45938263110787-30.8136398257315i",29.7845908707032,"0.0196200116479507-0.41426008464803i",-7.64480737533983,-87.2884076865026,{"$f":"IMPRODUCT(gmv,IMDIV((COMPLEX(1,I152*(Rvcomp*kOhms)*(Cvcomp*uF))),IMPRODUCT((COMPLEX(0,data!I152*((Cvcomp*uF)+(Cvcomp_p*uF)))),(COMPLEX(1,I152*((Rvcomp*kOhms)*(Cvcomp*uF)*(Cvcomp_p*uF))/((Cvcomp*uF)+(Cvcomp_p*uF)))))))","v":"0.02210207867633-0.0764960149031775i"},-21.9790100294206,"-0.0312556025679538-0.010656861686776i",-29.6238174047604,18.8272433987986]
[4.9,79432.8234724282,499091.149349751,"-0.025863641086875-0.00413856437667438i",-31.6364065762081,-170.908898384798,1.9,79.4328234724282,499.091149349751,0.0134440490312376,"0.921569363345258-24.4963770071559i",27.7881794252552,"0.0123896237065001-0.329330493571885i",-9.64121882078786,-87.8455121871685,{"$f":"IMPRODUCT(gmv,IMDIV((COMPLEX(1,I153*(Rvcomp*kOhms)*(Cvcomp*uF))),IMPRODUCT((COMPLEX(0,data!I153*((Cvcomp*uF)+(Cvcomp_p*uF)))),(COMPLEX(1,I153*((Rvcomp*kOhms)*(Cvcomp*uF)*(Cvcomp_p*uF))/((Cvcomp*uF)+(Cvcomp_p*uF)))))))","v":"0.0145096835554594-0.0628326644702182i"},-23.8106594253317,"-0.0205129428830611-0.00555695431615409i",-33.4518782461196,15.1576217045208]
[5,100000,628318.530717959,"-0.0164706034130126-0.00209348358750878i",-35.5962081233687,-172.75630511759,2,100,628.318530717959,0.0134440490312376,"0.581774395774101-19.468318044462i",25.7904451767509,"0.00782140350190564-0.261733022345475i",-11.6389530692922,-88.2883318150272,{"$f":"IMPRODUCT(gmv,IMDIV((COMPLEX(1,I154*(Rvcomp*kOhms)*(Cvcomp*uF))),IMPRODUCT((COMPLEX(0,data!I154*((Cvcomp*uF)+(Cvcomp_p*uF)))),(COMPLEX(1,I154*((Rvcomp*kOhms)*(Cvcomp*uF)*(Cvcomp_p*uF))/((Cvcomp*uF)+(Cvcomp_p*uF)))))))","v":"0.00939481930136736-0.051017318539111i"},-25.7008155413298,"-0.0132794363006199-0.00285796148401612i",-37.339768610622,12.1457677891924]
[5.1,125892.541179417,791006.165022013,"-0.0104535822410823-0.00105541968620236i",-39.5706518220689,-174.234811507071,2.1,125.892541179417,791.006165022012,0.0134440490312376,"0.36719573134618-15.4693281630711i",23.7918753777462,"0.00493659741627919-0.207970406304633i",-13.6375228682968,-88.640224360635,{"$f":"IMPRODUCT(gmv,IMDIV((COMPLEX(1,I155*(Rvcomp*kOhms)*(Cvcomp*uF))),IMPRODUCT((COMPLEX(0,data!I155*((Cvcomp*uF)+(Cvcomp_p*uF)))),(COMPLEX(1,I155*((Rvcomp*kOhms)*(Cvcomp*uF)*(Cvcomp_p*uF))/((Cvcomp*uF)+(Cvcomp_p*uF)))))))","v":"0.00602735528737418-0.0411037061816203i"},-27.6299854509628,"-0.00851859984867918-0.00145642397779327i",-41.2675083192596,9.70204570712133]
[5.2,158489.319246112,995817.762032063,"-0.00662041793168079-0.000530940013590772i",-43.5544491619303,-175.414843160738,2.2,158.489319246112,995.817762032063,0.0134440490312376,"0.231733001967371-12.2902782797561i",21.792778015967,"0.00311542984060522-0.165231103800596i",-15.636620230076,-88.9198169796442,{"$f":"IMPRODUCT(gmv,IMDIV((COMPLEX(1,I156*(Rvcomp*kOhms)*(Cvcomp*uF))),IMPRODUCT((COMPLEX(0,data!I156*((Cvcomp*uF)+(Cvcomp_p*uF)))),(COMPLEX(1,I156*((Rvcomp*kOhms)*(Cvcomp*uF)*(Cvcomp_p*uF))/((Cvcomp*uF)+(Cvcomp_p*uF)))))))","v":"0.0038437643393034-0.0329481692832848i"},-29.5846663276539,"-0.00543208740076312-0.000737757134310927i",-45.2212865577299,7.73428425443703]
[5.3,199526.231496888,1253660.28613816,"-0.00418707600228474-0.000266729403916007i",-47.5441947838621,-176.355010793496,2.3,199.526231496888,1253.66028613816,0.0134440490312376,"0.146232818259676-9.7637955904357i",19.7933476387254,"0.00196596117865914-0.131264946648799i",-17.6360506073176,-89.1419426132236,{"$f":"IMPRODUCT(gmv,IMDIV((COMPLEX(1,I157*(Rvcomp*kOhms)*(Cvcomp*uF))),IMPRODUCT((COMPLEX(0,data!I157*((Cvcomp*uF)+(Cvcomp_p*uF)))),(COMPLEX(1,I157*((Rvcomp*kOhms)*(Cvcomp*uF)*(Cvcomp_p*uF))/((Cvcomp*uF)+(Cvcomp_p*uF)))))))","v":"0.00244176387500812-0.0263238142949249i"},-31.5558159787061,"-0.00345059366603049-0.00037226960175996i",-49.1918665860237,6.15757713494534]
[5.4,251188.643150958,1578264.79197648,"-0.00264581271765571-0.000133881062382324i",-51.5377122285267,-177.10324058632,2.4,251.188643150958,1578.26479197648,0.0134440490312376,"0.092274307500459-7.75630044327368i",17.793707084834,"0.00124054031435967-0.104276083460381i",-19.635691161209,-89.3184019861981,{"$f":"IMPRODUCT(gmv,IMDIV((COMPLEX(1,I158*(Rvcomp*kOhms)*(Cvcomp*uF))),IMPRODUCT((COMPLEX(0,data!I158*((Cvcomp*uF)+(Cvcomp_p*uF)))),(COMPLEX(1,I158*((Rvcomp*kOhms)*(Cvcomp*uF)*(Cvcomp_p*uF))/((Cvcomp*uF)+(Cvcomp_p*uF)))))))","v":"0.00154729592222811-0.020986856609688i"},-33.5375092678522,"-0.00218650772843311-0.000187381000420169i",-53.1732004290613,4.89820936601075]
[5.5,316227.766016838,1986917.65315922,"-0.00167096987258336-0.000067162780900982i",-55.5336170282619,-177.698298654371,2.5,316.227766016838,1986.91765315922,0.0134440490312376,"0.0582241927056773-6.16137020850493i",15.7939338953043,"0.000782768901539352-0.0828337631827469i",-21.6354643507387,-89.4585780275806,{"$f":"IMPRODUCT(gmv,IMDIV((COMPLEX(1,I159*(Rvcomp*kOhms)*(Cvcomp*uF))),IMPRODUCT((COMPLEX(0,data!I159*((Cvcomp*uF)+(Cvcomp_p*uF)))),(COMPLEX(1,I159*((Rvcomp*kOhms)*(Cvcomp*uF)*(Cvcomp_p*uF))/((Cvcomp*uF)+(Cvcomp_p*uF)))))))","v":"0.000978942644849406-0.0167093708212089i"},-35.5259169802248,"-0.00138333377967794-0.000094169079056079i",-57.1613813309635,3.89434538795595]
[5.6,398107.170553497,2501381.12470457,"-0.00105493866026242-0.0000336811769078575i",-59.5310311432522,-178.171330662249,2.6,398.107170553498,2501.38112470457,0.0134440490312376,"0.0367381926342753-4.89431160166104i",13.7940770091314,"0.000493910063094249-0.0657993651468861i",-23.6353212369117,-89.5699285163134,{"$f":"IMPRODUCT(gmv,IMDIV((COMPLEX(1,I160*(Rvcomp*kOhms)*(Cvcomp*uF))),IMPRODUCT((COMPLEX(0,data!I160*((Cvcomp*uF)+(Cvcomp_p*uF)))),(COMPLEX(1,I160*((Rvcomp*kOhms)*(Cvcomp*uF)*(Cvcomp_p*uF))/((Cvcomp*uF)+(Cvcomp_p*uF)))))))","v":"0.000618736706167759-0.0132923172483264i"},-37.5185861093867,"-0.000874320435985299-0.0000472776917097036i",-61.1539073462984,3.0951771901793]
[5.7,501187.233627273,3149052.26247287,"-0.000665871528703846-0.0000168869219473592i",-63.5293987675359,-178.547254290555,2.7,501.187233627273,3149.05226247286,0.0134440490312376,"0.0231807144480095-3.88777073078831i",11.7941673102782,"0.000311642661618158-0.0522673803269285i",-25.6352309357648,-89.6583797098261,{"$f":"IMPRODUCT(gmv,IMDIV((COMPLEX(1,I161*(Rvcomp*kOhms)*(Cvcomp*uF))),IMPRODUCT((COMPLEX(0,data!I161*((Cvcomp*uF)+(Cvcomp_p*uF)))),(COMPLEX(1,I161*((Rvcomp*kOhms)*(Cvcomp*uF)*(Cvcomp_p*uF))/((Cvcomp*uF)+(Cvcomp_p*uF)))))))","v":"0.000390821908848058-0.0105683099264845i"},-39.5139539968345,"-0.000552256077560527-0.0000237207735841529i",-65.1491849325993,2.45948461877762]
[5.8,630957.344480194,3964421.916295,"-0.000420236212176847-8.46551772880069E-06i",-67.5283684923036,-178.845951804196,2.8,630.957344480193,3964.421916295,0.0134440490312376,"0.0146262339184605-3.08820657697019i",9.79422428741616,"0.000196635805942133-0.0415180006393777i",-27.6351739586269,-89.7286401712591,{"$f":"IMPRODUCT(gmv,IMDIV((COMPLEX(1,I162*(Rvcomp*kOhms)*(Cvcomp*uF))),IMPRODUCT((COMPLEX(0,data!I162*((Cvcomp*uF)+(Cvcomp_p*uF)))),(COMPLEX(1,I162*((Rvcomp*kOhms)*(Cvcomp*uF)*(Cvcomp_p*uF))/((Cvcomp*uF)+(Cvcomp_p*uF)))))))","v":"0.000246761625642615-0.00839965095192552i"},-41.5110286794913,"-0.000348688191421459-0.0000118967214657685i",-69.1462026381181,1.95408861459336]
[5.9,794328.234724283,4990911.49349752,"-0.00026519082343354-4.24344465342874E-06i",-71.5277183067988,-179.083261184413,2.9,794.328234724282,4990.91149349751,0.0134440490312376,"0.00922860610623907-2.45306998496954i",7.79426023794442,"0.000124069832982257-0.0329791931549878i",-29.6351380080986,-89.7844506314941,{"$f":"IMPRODUCT(gmv,IMDIV((COMPLEX(1,I163*(Rvcomp*kOhms)*(Cvcomp*uF))),IMPRODUCT((COMPLEX(0,data!I163*((Cvcomp*uF)+(Cvcomp_p*uF)))),(COMPLEX(1,I163*((Rvcomp*kOhms)*(Cvcomp*uF)*(Cvcomp_p*uF))/((Cvcomp*uF)+(Cvcomp_p*uF)))))))","v":"0.000155763683459032-0.00667456055649331i"},-43.5091818717268,"-0.000220102296243064-5.96507221680188E-06i",-73.1443198798254,1.55241371627031]
[6,1000000,6283185.30717959,"-0.000167339906028074-2.12696121702658E-06i",-75.527308017389,-179.271785542524,3,1000,6283.18530717959,0.0134440490312376,"0.00582288721517789-1.94855292817205i",5.79428292134738,"0.0000782831812242181-0.0261964411063066i",-31.6351153246957,-89.8287827525267,{"$f":"IMPRODUCT(gmv,IMDIV((COMPLEX(1,I164*(Rvcomp*kOhms)*(Cvcomp*uF))),IMPRODUCT((COMPLEX(0,data!I164*((Cvcomp*uF)+(Cvcomp_p*uF)))),(COMPLEX(1,I164*((Rvcomp*kOhms)*(Cvcomp*uF)*(Cvcomp_p*uF))/((Cvcomp*uF)+(Cvcomp_p*uF)))))))","v":"0.0000983071805273432-0.0053030360522166i"},-45.5080161934923,"-0.000138912975827684-2.99043679732583E-06i",-77.1431315181879,1.23323934150054]
[null,null,null,null,null,null,3.1,1258.92541179417,7910.06165022013,0.0134440490312376,"0.00367400556228522-1.54779570850613i",3.79429723366807,"0.0000493935109204022-0.0208086413954956i",-33.6351010123749,-89.8639971566595,{"$f":"IMPRODUCT(gmv,IMDIV((COMPLEX(1,I165*(Rvcomp*kOhms)*(Cvcomp*uF))),IMPRODUCT((COMPLEX(0,data!I165*((Cvcomp*uF)+(Cvcomp_p*uF)))),(COMPLEX(1,I165*((Rvcomp*kOhms)*(Cvcomp*uF)*(Cvcomp_p*uF))/((Cvcomp*uF)+(Cvcomp_p*uF)))))))","v":"0.0000620383675492297-0.00421297509586181i"},-47.5072805324232,"-0.0000876632236851571-0.0000014990277744987i",-81.1423815447981,0.979653626219203]
[null,null,null,null,null,null,3.2,1584.89319246112,9958.17762032063,0.0134440490312376,"0.00231814561340842-1.22946038932327i",1.79430626415615,"0.0000311652632882112-0.0165289257560265i",-35.6350919818869,-89.8919690266538,{"$f":"IMPRODUCT(gmv,IMDIV((COMPLEX(1,I166*(Rvcomp*kOhms)*(Cvcomp*uF))),IMPRODUCT((COMPLEX(0,data!I166*((Cvcomp*uF)+(Cvcomp_p*uF)))),(COMPLEX(1,I166*((Rvcomp*kOhms)*(Cvcomp*uF)*(Cvcomp_p*uF))/((Cvcomp*uF)+(Cvcomp_p*uF)))))))","v":"0.0000391478365321913-0.00334679781459827i"},-49.5068162948312,"-0.0000553177525452939-7.51375518614017E-07i",-85.141908276718,0.778195006354395]
[null,null,null,null,null,null,3.3,1995.26231496888,12536.6028613816,0.0134440490312376,"0.00146265291932664-0.97659638198995i",-0.205688037981367,"0.0000196639775631102-0.0131294096432021i",-37.6350862840244,-89.9141879101184,{"$f":"IMPRODUCT(gmv,IMDIV((COMPLEX(1,I167*(Rvcomp*kOhms)*(Cvcomp*uF))),IMPRODUCT((COMPLEX(0,data!I167*((Cvcomp*uF)+(Cvcomp_p*uF)))),(COMPLEX(1,I167*((Rvcomp*kOhms)*(Cvcomp*uF)*(Cvcomp_p*uF))/((Cvcomp*uF)+(Cvcomp_p*uF)))))))","v":"0.0000247023163504953-0.00265861277113893i"},-51.5065233540982,"-0.0000349055304091373-3.76605732382296E-07i",-89.1416096381226,0.618156536394224]
[null,null,null,null,null,null,3.4,2511.88643150958,15782.6479197648,0.0134440490312376,"0.000922872365832697-0.775738722304425i",-2.20568444286938,"0.000012407141335829-0.0104290694180903i",-39.6350826889124,-89.9318370153178,{"$f":"IMPRODUCT(gmv,IMDIV((COMPLEX(1,I168*(Rvcomp*kOhms)*(Cvcomp*uF))),IMPRODUCT((COMPLEX(0,data!I168*((Cvcomp*uF)+(Cvcomp_p*uF)))),(COMPLEX(1,I168*((Rvcomp*kOhms)*(Cvcomp*uF)*(Cvcomp_p*uF))/((Cvcomp*uF)+(Cvcomp_p*uF)))))))","v":"0.0000155867853307087-0.00211188976981023i"},-53.5063385103942,"-0.0000220248516252571-1.88758181078559E-07i",-93.1414211993066,0.491026343125043]
[null,null,null,null,null,null,3.5,3162.27766016838,19869.1765315922,0.0134440490312376,"0.000582293401377591-0.61619149173829i",-4.20568217450548,"7.82838103868645E-06-0.00828410862756101i",-41.6350804205485,-89.9458562072773,{"$f":"IMPRODUCT(gmv,IMDIV((COMPLEX(1,I169*(Rvcomp*kOhms)*(Cvcomp*uF))),IMPRODUCT((COMPLEX(0,data!I169*((Cvcomp*uF)+(Cvcomp_p*uF)))),(COMPLEX(1,I169*((Rvcomp*kOhms)*(Cvcomp*uF)*(Cvcomp_p*uF))/((Cvcomp*uF)+(Cvcomp_p*uF)))))))","v":"9.83486637962998E-06-0.00167757305911881i"},-55.5062218776824,"-0.0000138971204613286-9.46057825534193E-08i",-97.1413022982309,0.390039673376037]
[null,null,null,null,null,null,3.6,3981.07170553498,25013.8112470457,0.0134440490312376,"0.000367402419321021-0.48945846118831i",-6.20568074326403,"4.93937613954712E-06-0.00658030355096975i",-43.635078989307,-89.9569920519808,{"$f":"IMPRODUCT(gmv,IMDIV((COMPLEX(1,I170*(Rvcomp*kOhms)*(Cvcomp*uF))),IMPRODUCT((COMPLEX(0,data!I170*((Cvcomp*uF)+(Cvcomp_p*uF)))),(COMPLEX(1,I170*((Rvcomp*kOhms)*(Cvcomp*uF)*(Cvcomp_p*uF))/((Cvcomp*uF)+(Cvcomp_p*uF)))))))","v":"6.20548854787154E-06-0.00133256338748115i"},-57.5061482857364,"-8.76864093929242E-06-4.74160301276197E-08i",-101.141227275043,0.309821322048947]
[null,null,null,null,null,null,3.7,5011.87233627273,31490.5226247287,0.0134440490312376,"0.00023181530305302-0.388790756289975i",-8.20567984021156,"0.000003116536300436-0.00522692199045437i",-45.6350780862546,-89.9658375702029,{"$f":"IMPRODUCT(gmv,IMDIV((COMPLEX(1,I171*(Rvcomp*kOhms)*(Cvcomp*uF))),IMPRODUCT((COMPLEX(0,data!I171*((Cvcomp*uF)+(Cvcomp_p*uF)))),(COMPLEX(1,I171*((Rvcomp*kOhms)*(Cvcomp*uF)*(Cvcomp_p*uF))/((Cvcomp*uF)+(Cvcomp_p*uF)))))))","v":"3.91544132279858E-06-0.00105850261735742i"},-59.5061018516889,"-5.53269840500399E-06-2.37645681835706E-08i",-105.141179937944,0.246100724383439]
[null,null,null,null,null,null,3.8,6309.57344480194,39644.21916295,0.0134440490312376,"0.000146265587214027-0.308827515638632i",-10.2056792704238,"1.96640172608814E-06-0.00415189226244107i",-47.6350775164668,-89.9728638162586,{"$f":"IMPRODUCT(gmv,IMDIV((COMPLEX(1,I172*(Rvcomp*kOhms)*(Cvcomp*uF))),IMPRODUCT((COMPLEX(0,data!I172*((Cvcomp*uF)+(Cvcomp_p*uF)))),(COMPLEX(1,I172*((Rvcomp*kOhms)*(Cvcomp*uF)*(Cvcomp_p*uF))/((Cvcomp*uF)+(Cvcomp_p*uF)))))))","v":"2.47049347786298E-06-0.000840803474392134i"},-61.5060725535194,"-3.49092058157963E-06-1.1910580158496E-08i",-109.141150069986,0.19548520531805]
[null,null,null,null,null,null,3.9,7943.28234724282,49909.114934975,0.0134440490312376,"0.0000922873541370054-0.245310435638477i",-12.205678910912,"1.24071571398109E-06-0.00329796552459794i",-49.635077156955,-89.9784449624768,{"$f":"IMPRODUCT(gmv,IMDIV((COMPLEX(1,I173*(Rvcomp*kOhms)*(Cvcomp*uF))),IMPRODUCT((COMPLEX(0,data!I173*((Cvcomp*uF)+(Cvcomp_p*uF)))),(COMPLEX(1,I173*((Rvcomp*kOhms)*(Cvcomp*uF)*(Cvcomp_p*uF))/((Cvcomp*uF)+(Cvcomp_p*uF)))))))","v":"1.55878277955612E-06-0.000667876424927034i"},-63.5060540675182,"-2.20263149009479E-06-5.96945664271752E-09i",-113.141131224473,0.155279644269456]
[null,null,null,null,null,null,4,10000,62831.8530717959,0.0134440490312376,"0.0000582293869367705-0.194857015477744i",-14.2056786840754,"7.82838733036849E-07-0.00261966727016341i",-51.6350769301184,-89.9828782247967,{"$f":"IMPRODUCT(gmv,IMDIV((COMPLEX(1,I174*(Rvcomp*kOhms)*(Cvcomp*uF))),IMPRODUCT((COMPLEX(0,data!I174*((Cvcomp*uF)+(Cvcomp_p*uF)))),(COMPLEX(1,I174*((Rvcomp*kOhms)*(Cvcomp*uF)*(Cvcomp_p*uF))/((Cvcomp*uF)+(Cvcomp_p*uF)))))))","v":"9.83528140488214E-07-0.000530514347267335i"},-65.5060424035977,"-1.38977030194442E-06-2.99182365839429E-09i",-117.141119333716,0.123343119097484]
[]
[]
[]
[]
[]
["Standard E48 Resistor Values"]
[100,105]
[105,110]
[110,115]
[115,121]
[121,127]
[127,133]
[133,140]
[140,147]
[147,154]
[154,162]
[162,169]
[169,178]
[178,187]
[187,196]
[196,205]
[205,215]
[215,226]
[226,237]
[237,249]
[249,261]
[261,274]
[274,287]
[287,301]
[301,316]
[316,332]
[332,348]
[348,365]
[365,383]
[383,402]
[402,422]
[422,442]
[442,464]
[464,487]
[487,511]
[511,536]
[536,562,null,null,"VREFnom",5]
[562,590,null,null,"VREFmin",4.93]
[590,619,null,null,"VREFmax",5.07]
[619,649]
[649,681]
[681,715]
[715,750]
[750,787]
[787,825]
[825,866,null,null,"Standard Component Value Calculations"]
[866,909]
[909,953,null,null,"CIN",{"$f":"((L_I_ripple_factor*Iin_peak_max)/(8*fsw*kHz*Vin_ripple))/picoF","v":877747.442612732}]
[953,1000,null,null,null,{"$f":"(IF(Cin_initial<10000,F229*10^INT(LOG(Cin_initial)),F230*10^INT(LOG(Cin_initial))*uF))","v":0.82},{"$f":"IF(Cin_initial<10000,\"pF\",I236)","v":"µF"}]
[null,null,null,null,null,{"$f":"IF((10^(LOG(Cin_initial)-INT(LOG(Cin_initial))))-VLOOKUP((10^(LOG(Cin_initial)-INT(LOG(Cin_initial)))),C_s1:C_f1,1)<VLOOKUP((10^(LOG(Cin_initial)-INT(LOG(Cin_initial)))),C_s1:C_f1,2)-(10^(LOG(Cin_initial)-INT(LOG(Cin_initial)))),VLOOKUP((10^(LOG(Cin_initial)-INT(LOG(Cin_initial)))),C_s1:C_f1,1),VLOOKUP((10^(LOG(Cin_initial)-INT(LOG(Cin_initial)))),C_s1:C_f1,2))","v":8.2}]
[null,null,null,null,null,{"$f":"IF((10^(LOG(Cin_initial)-INT(LOG(Cin_initial))))-VLOOKUP((10^(LOG(Cin_initial)-INT(LOG(Cin_initial)))),C_s2:C_f2,1)<VLOOKUP((10^(LOG(Cin_initial)-INT(LOG(Cin_initial)))),C_s2:C_f2,2)-(10^(LOG(Cin_initial)-INT(LOG(Cin_initial)))),VLOOKUP((10^(LOG(Cin_initial)-INT(LOG(Cin_initial)))),C_s2:C_f2,1),VLOOKUP((10^(LOG(Cin_initial)-INT(LOG(Cin_initial)))),C_s2:C_f2,2))","v":8.2}]
[]
["Standard Capacitor Values",null,null,null,"RFREQ =",{"$f":"((1*MegOhm*32.7*kOhms*65*kHz)/((1*MegOhm*fSW_target*kHz)+(32.7*kOhms*fSW_target*kHz)-(32.7*kOhms*65*kHz)))/kOhms","v":44.1997522867461}]
["C values up to 10nF",null,null,null,null,{"$f":"(IF((10^(LOG(Rfreq_initial)-INT(LOG(Rfreq_initial)))*100)-VLOOKUP((10^(LOG(Rfreq_initial)-INT(LOG(Rfreq_initial)))*100),E_48s:E_48f,1)<VLOOKUP((10^(LOG(Rfreq_initial)-INT(LOG(Rfreq_initial)))*100),E_48s:E_48f,2)-(10^(LOG(Rfreq_initial)-INT(LOG(Rfreq_initial)))*100),VLOOKUP((10^(LOG(Rfreq_initial)-INT(LOG(Rfreq_initial)))*100),E_48s:E_48f,1),VLOOKUP((10^(LOG(Rfreq_initial)-INT(LOG(Rfreq_initial)))*100),E_48s:E_48f,2)))*10^INT(LOG(Rfreq_initial))/100","v":44.2},"kΩ"]
[1,1.2]
[1.2,1.5,null,null,"COUT",{"$f":"(((2*Pout*t_holdup*ms)/((Vout^2)-(Vout_holdup^2))))/picoF","v":434530732.357939}]
[1.5,1.8,null,null,"COUT",{"$f":"(IF(Cout_initial<10000,F237*10^INT(LOG(Cout_initial)),F238*10^INT(LOG(Cout_initial))*uF))","v":470},{"$f":"IF(Cout_initial<10000,\"pF\",I236)","v":"µF"},null,"µF"]
[1.8,2.2,null,null,null,{"$f":"IF((10^(LOG(Cout_initial)-INT(LOG(Cout_initial))))-VLOOKUP((10^(LOG(Cout_initial)-INT(LOG(Cout_initial)))),C_s1:C_f1,1)<VLOOKUP((10^(LOG(Cout_initial)-INT(LOG(Cout_initial)))),C_s1:C_f1,2)-(10^(LOG(Cout_initial)-INT(LOG(Cout_initial)))),VLOOKUP((10^(LOG(Cout_initial)-INT(LOG(Cout_initial)))),C_s1:C_f1,1),VLOOKUP((10^(LOG(Cout_initial)-INT(LOG(Cout_initial)))),C_s1:C_f1,2))","v":4.7}]
[2.2,2.7,null,null,null,{"$f":"IF((10^(LOG(Cout_initial)-INT(LOG(Cout_initial))))-VLOOKUP((10^(LOG(Cout_initial)-INT(LOG(Cout_initial)))),C_s2:C_f2,1)<VLOOKUP((10^(LOG(Cout_initial)-INT(LOG(Cout_initial)))),C_s2:C_f2,2)-(10^(LOG(Cout_initial)-INT(LOG(Cout_initial)))),VLOOKUP((10^(LOG(Cout_initial)-INT(LOG(Cout_initial)))),C_s2:C_f2,1),VLOOKUP((10^(LOG(Cout_initial)-INT(LOG(Cout_initial)))),C_s2:C_f2,2))","v":4.7}]
[2.7,3.3]
[3.3,3.9]
[3.9,4.7,null,null,"RFB2 =",{"$f":"(VREF*R_fb1*kOhms)/(Vout-VREF)","v":13.6}]
[4.7,5.6,null,null,null,{"$f":"(IF((10^(LOG(Rfb2initial)-INT(LOG(Rfb2initial)))*100)-VLOOKUP((10^(LOG(Rfb2initial)-INT(LOG(Rfb2initial)))*100),E_48s:E_48f,1)<VLOOKUP((10^(LOG(Rfb2initial)-INT(LOG(Rfb2initial)))*100),E_48s:E_48f,2)-(10^(LOG(Rfb2initial)-INT(LOG(Rfb2initial)))*100),VLOOKUP((10^(LOG(Rfb2initial)-INT(LOG(Rfb2initial)))*100),E_48s:E_48f,1),VLOOKUP((10^(LOG(Rfb2initial)-INT(LOG(Rfb2initial)))*100),E_48s:E_48f,2)))*10^INT(LOG(Rfb2initial))/100","v":13.3},"kΩ"]
[5.6,6.8]
[6.8,8.2,null,null,"CVSENSE",{"$f":"((10*us)/(R_fb2*kOhms))/picoF","v":735.294117647059}]
[8.2,10,null,null,"CVSENSE",{"$f":"(IF(Cvsense_initial<10000,F246*10^INT(LOG(Cvsense_initial)),F247*10^INT(LOG(Cvsense_initial))*uF))","v":680},{"$f":"IF(Cvsense_initial<10000,\"pF\",I236)","v":"pF"}]
["C values greater than 10nF",null,null,null,null,{"$f":"IF((10^(LOG(Cvsense_initial)-INT(LOG(Cvsense_initial))))-VLOOKUP((10^(LOG(Cvsense_initial)-INT(LOG(Cvsense_initial)))),C_s1:C_f1,1)<VLOOKUP((10^(LOG(Cvsense_initial)-INT(LOG(Cvsense_initial)))),C_s1:C_f1,2)-(10^(LOG(Cvsense_initial)-INT(LOG(Cvsense_initial)))),VLOOKUP((10^(LOG(Cvsense_initial)-INT(LOG(Cvsense_initial)))),C_s1:C_f1,1),VLOOKUP((10^(LOG(Cvsense_initial)-INT(LOG(Cvsense_initial)))),C_s1:C_f1,2))","v":6.8}]
[1,1.2,null,null,null,{"$f":"IF((10^(LOG(Cvsense_initial)-INT(LOG(Cvsense_initial))))-VLOOKUP((10^(LOG(Cvsense_initial)-INT(LOG(Cvsense_initial)))),C_s2:C_f2,1)<VLOOKUP((10^(LOG(Cvsense_initial)-INT(LOG(Cvsense_initial)))),C_s2:C_f2,2)-(10^(LOG(Cvsense_initial)-INT(LOG(Cvsense_initial)))),VLOOKUP((10^(LOG(Cvsense_initial)-INT(LOG(Cvsense_initial)))),C_s2:C_f2,1),VLOOKUP((10^(LOG(Cvsense_initial)-INT(LOG(Cvsense_initial)))),C_s2:C_f2,2))","v":6.8}]
[1.2,1.5]
[1.5,1.8,null,null,"gmi",{"$f":"0.95*10^-3","v":0.00095},null,"gmv",{"$f":"0.056*10^-3","v":5.6e-5}]
[1.8,2.2]
[2.2,2.7,null,null,"CICOMPmax",{"$f":"((gmi*M_1)/(K_1*2*PI()*((fsw*kHz)/40)))/picoF","v":7110.18011672703}]
[2.7,3.3,null,null,"CICOMPmax",{"$f":"(IF(CICOMPmax_initial<10000,F253*10^INT(LOG(CICOMPmax_initial)),F254*10^INT(LOG(CICOMPmax_initial))*uF))","v":6800},{"$f":"IF(CICOMPmax_initial<10000,\"pF\",I236)","v":"pF"}]
[3.3,3.9,null,null,null,{"$f":"IF((10^(LOG(CICOMPmax_initial)-INT(LOG(CICOMPmax_initial))))-VLOOKUP((10^(LOG(CICOMPmax_initial)-INT(LOG(CICOMPmax_initial)))),C_s1:C_f1,1)<VLOOKUP((10^(LOG(CICOMPmax_initial)-INT(LOG(CICOMPmax_initial)))),C_s1:C_f1,2)-(10^(LOG(CICOMPmax_initial)-INT(LOG(CICOMPmax_initial)))),VLOOKUP((10^(LOG(CICOMPmax_initial)-INT(LOG(CICOMPmax_initial)))),C_s1:C_f1,1),VLOOKUP((10^(LOG(CICOMPmax_initial)-INT(LOG(CICOMPmax_initial)))),C_s1:C_f1,2))","v":6.8}]
[3.9,4.7,null,null,null,{"$f":"IF((10^(LOG(CICOMPmax_initial)-INT(LOG(CICOMPmax_initial))))-VLOOKUP((10^(LOG(CICOMPmax_initial)-INT(LOG(CICOMPmax_initial)))),C_s2:C_f2,1)<VLOOKUP((10^(LOG(CICOMPmax_initial)-INT(LOG(CICOMPmax_initial)))),C_s2:C_f2,2)-(10^(LOG(CICOMPmax_initial)-INT(LOG(CICOMPmax_initial)))),VLOOKUP((10^(LOG(CICOMPmax_initial)-INT(LOG(CICOMPmax_initial)))),C_s2:C_f2,1),VLOOKUP((10^(LOG(CICOMPmax_initial)-INT(LOG(CICOMPmax_initial)))),C_s2:C_f2,2))","v":6.8}]
[4.7,6.8]
[6.8,8.2,null,null,"CICOMPmin",{"$f":"((gmi*M_1)/(K_1*2*PI()*((fsw*kHz)/20)))/picoF","v":3555.09005836351}]
[8.2,10,null,null,"CICOMPmin",{"$f":"(IF(CICOMPmin_initial<10000,F258*10^INT(LOG(CICOMPmin_initial)),F259*10^INT(LOG(CICOMPmin_initial))*uF))","v":3300},{"$f":"IF(CICOMPmax_initial<10000,\"pF\",I241)","v":"pF"}]
[null,null,null,null,null,{"$f":"IF((10^(LOG(CICOMPmin_initial)-INT(LOG(CICOMPmin_initial))))-VLOOKUP((10^(LOG(CICOMPmin_initial)-INT(LOG(CICOMPmin_initial)))),C_s1:C_f1,1)<VLOOKUP((10^(LOG(CICOMPmin_initial)-INT(LOG(CICOMPmin_initial)))),C_s1:C_f1,2)-(10^(LOG(CICOMPmin_initial)-INT(LOG(CICOMPmin_initial)))),VLOOKUP((10^(LOG(CICOMPmin_initial)-INT(LOG(CICOMPmin_initial)))),C_s1:C_f1,1),VLOOKUP((10^(LOG(CICOMPmin_initial)-INT(LOG(CICOMPmin_initial)))),C_s1:C_f1,2))","v":3.3}]
[null,null,null,null,null,{"$f":"IF((10^(LOG(CICOMPmin_initial)-INT(LOG(CICOMPmin_initial))))-VLOOKUP((10^(LOG(CICOMPmin_initial)-INT(LOG(CICOMPmin_initial)))),C_s2:C_f2,1)<VLOOKUP((10^(LOG(CICOMPmin_initial)-INT(LOG(CICOMPmin_initial)))),C_s2:C_f2,2)-(10^(LOG(CICOMPmin_initial)-INT(LOG(CICOMPmin_initial)))),VLOOKUP((10^(LOG(CICOMPmin_initial)-INT(LOG(CICOMPmin_initial)))),C_s2:C_f2,1),VLOOKUP((10^(LOG(CICOMPmin_initial)-INT(LOG(CICOMPmin_initial)))),C_s2:C_f2,2))","v":3.3}]
[]
[null,null,null,null,"CVCOMP",{"$f":"((((56*10^-6)*fv)/fPWM_PSpole)/((10^((0-GVL_dB)/20))*2*PI()*fv))/picoF","v":7486078.41949271}]
[null,null,null,null,null,{"$f":"(IF(CVCOMPinitial<10000,F263*10^INT(LOG(CVCOMPinitial)),F264*10^INT(LOG(CVCOMPinitial))*uF))","v":6.8},{"$f":"IF(CVCOMPinitial<10000,\"pF\",I236)","v":"µF"}]
[null,null,null,null,null,{"$f":"IF((10^(LOG(CVCOMPinitial)-INT(LOG(CVCOMPinitial))))-VLOOKUP((10^(LOG(CVCOMPinitial)-INT(LOG(CVCOMPinitial)))),C_s1:C_f1,1)<VLOOKUP((10^(LOG(CVCOMPinitial)-INT(LOG(CVCOMPinitial)))),C_s1:C_f1,2)-(10^(LOG(CVCOMPinitial)-INT(LOG(CVCOMPinitial)))),VLOOKUP((10^(LOG(CVCOMPinitial)-INT(LOG(CVCOMPinitial)))),C_s1:C_f1,1),VLOOKUP((10^(LOG(CVCOMPinitial)-INT(LOG(CVCOMPinitial)))),C_s1:C_f1,2))","v":6.8}]
[null,null,null,null,null,{"$f":"IF((10^(LOG(CVCOMPinitial)-INT(LOG(CVCOMPinitial))))-VLOOKUP((10^(LOG(CVCOMPinitial)-INT(LOG(CVCOMPinitial)))),C_s2:C_f2,1)<VLOOKUP((10^(LOG(CVCOMPinitial)-INT(LOG(CVCOMPinitial)))),C_s2:C_f2,2)-(10^(LOG(CVCOMPinitial)-INT(LOG(CVCOMPinitial)))),VLOOKUP((10^(LOG(CVCOMPinitial)-INT(LOG(CVCOMPinitial)))),C_s2:C_f2,1),VLOOKUP((10^(LOG(CVCOMPinitial)-INT(LOG(CVCOMPinitial)))),C_s2:C_f2,2))","v":6.8}]
[]
[null,null,null,null,"RVCOMP",{"$f":"(1/(2*PI()*fPWM_PSpole*Cvcomp*uF))/(kOhms)","v":5.32591168151785}]
[null,null,null,null,null,{"$f":"(IF((10^(LOG(Rvcomp_initial)-INT(LOG(Rvcomp_initial)))*100)-VLOOKUP((10^(LOG(Rvcomp_initial)-INT(LOG(Rvcomp_initial)))*100),E_48s:E_48f,1)<VLOOKUP((10^(LOG(Rvcomp_initial)-INT(LOG(Rvcomp_initial)))*100),E_48s:E_48f,2)-(10^(LOG(Rvcomp_initial)-INT(LOG(Rvcomp_initial)))*100),VLOOKUP((10^(LOG(Rvcomp_initial)-INT(LOG(Rvcomp_initial)))*100),E_48s:E_48f,1),VLOOKUP((10^(LOG(Rvcomp_initial)-INT(LOG(Rvcomp_initial)))*100),E_48s:E_48f,2)))*10^INT(LOG(Rvcomp_initial))/100","v":5.36},"kΩ"]
[]
[]
[null,null,null,null,"CVCOMP_P",{"$f":"((Cvcomp*uF)/((2*PI()*fpole*(Rvcomp*kOhms)*(Cvcomp*uF))-1))/picoF","v":1844536.76610499}]
[null,null,null,null,null,{"$f":"(IF(Cvcomp_p_initial<10000,F272*10^INT(LOG(Cvcomp_p_initial)),F273*10^INT(LOG(Cvcomp_p_initial))*uF))","v":1.8},{"$f":"IF(Cvcomp_p_initial<10000,\"pF\",I236)","v":"µF"}]
[null,null,null,null,null,{"$f":"IF((10^(LOG(Cvcomp_p_initial)-INT(LOG(Cvcomp_p_initial))))-VLOOKUP((10^(LOG(Cvcomp_p_initial)-INT(LOG(Cvcomp_p_initial)))),C_s1:C_f1,1)<VLOOKUP((10^(LOG(Cvcomp_p_initial)-INT(LOG(Cvcomp_p_initial)))),C_s1:C_f1,2)-(10^(LOG(Cvcomp_p_initial)-INT(LOG(Cvcomp_p_initial)))),VLOOKUP((10^(LOG(Cvcomp_p_initial)-INT(LOG(Cvcomp_p_initial)))),C_s1:C_f1,1),VLOOKUP((10^(LOG(Cvcomp_p_initial)-INT(LOG(Cvcomp_p_initial)))),C_s1:C_f1,2))","v":1.8}]
[null,null,null,null,null,{"$f":"IF((10^(LOG(Cvcomp_p_initial)-INT(LOG(Cvcomp_p_initial))))-VLOOKUP((10^(LOG(Cvcomp_p_initial)-INT(LOG(Cvcomp_p_initial)))),C_s2:C_f2,1)<VLOOKUP((10^(LOG(Cvcomp_p_initial)-INT(LOG(Cvcomp_p_initial)))),C_s2:C_f2,2)-(10^(LOG(Cvcomp_p_initial)-INT(LOG(Cvcomp_p_initial)))),VLOOKUP((10^(LOG(Cvcomp_p_initial)-INT(LOG(Cvcomp_p_initial)))),C_s2:C_f2,1),VLOOKUP((10^(LOG(Cvcomp_p_initial)-INT(LOG(Cvcomp_p_initial)))),C_s2:C_f2,2))","v":1.8}]
[]
[null,null,null,null,"CISENSE",{"$f":"(1/(15*fsw*kHz*PI()*Risense))/picoF","v":1983.75409205899}]
[null,null,null,null,null,{"$f":"(IF(Cisense_initial<10000,F277*10^INT(LOG(Cisense_initial)),F278*10^INT(LOG(Cisense_initial))*uF))","v":1800},{"$f":"IF(Cisense_initial<10000,\"pF\",I236)","v":"pF"}]
[null,null,null,null,null,{"$f":"IF((10^(LOG(Cisense_initial)-INT(LOG(Cisense_initial))))-VLOOKUP((10^(LOG(Cisense_initial)-INT(LOG(Cisense_initial)))),C_s1:C_f1,1)<VLOOKUP((10^(LOG(Cisense_initial)-INT(LOG(Cisense_initial)))),C_s1:C_f1,2)-(10^(LOG(Cisense_initial)-INT(LOG(Cisense_initial)))),VLOOKUP((10^(LOG(Cisense_initial)-INT(LOG(Cisense_initial)))),C_s1:C_f1,1),VLOOKUP((10^(LOG(Cisense_initial)-INT(LOG(Cisense_initial)))),C_s1:C_f1,2))","v":1.8}]
[null,null,null,null,null,{"$f":"IF((10^(LOG(Cisense_initial)-INT(LOG(Cisense_initial))))-VLOOKUP((10^(LOG(Cisense_initial)-INT(LOG(Cisense_initial)))),C_s2:C_f2,1)<VLOOKUP((10^(LOG(Cisense_initial)-INT(LOG(Cisense_initial)))),C_s2:C_f2,2)-(10^(LOG(Cisense_initial)-INT(LOG(Cisense_initial)))),VLOOKUP((10^(LOG(Cisense_initial)-INT(LOG(Cisense_initial)))),C_s2:C_f2,1),VLOOKUP((10^(LOG(Cisense_initial)-INT(LOG(Cisense_initial)))),C_s2:C_f2,2))","v":1.8}]

{"sheet":"VCOMP","index":3,"n_rows":290,"n_cols":26,"rows_kept":290,"cut":false,"hidden":true,"merged":[[0,0,0,4],[8,0,8,1],[9,3,9,4],[10,0,10,1],[11,3,11,4],[12,0,12,1],[13,3,13,4],[22,0,22,1],[23,3,23,4],[33,0,33,1],[34,3,34,4],[38,0,38,1],[39,3,39,4],[42,0,42,1],[43,3,43,4],[1,3,3,4],[1,0,3,1]]}
["To Calculate VCOMP "]
["At User Selectable Line Voltage, Full Load",null,null,"At User Selectable Line Voltage, % of Load"]
[]
[]
["VLINE",{"$f":"Vline","v":220},null,"VLINE",{"$f":"Vline","v":220},null,"VCOMP as a function of Line voltage at full load"]
["K1",7,null,"Percent Load",{"$f":"percent_load/100","v":1},null,"VLINE","M1M2","VCOMP1","K1V2","K2V2","K3V2","K4V2","VCOMP2","K1V3","K2V3","K3V3","K4V3","K5V3","VCOMP3","VCOMP4","VCOMP5","VCOMP","IAC RMS","ISENSE_Pk","ICOMP"]
["KFQ",{"$f":"1/(fsw*kHz)","v":2.0566086031066e-5},null,"K1",7,null,{"$f":"Vacin_min","v":172},{"$f":"(Iout*(Vout_nom^2)*2.5*Rsense*K_1)/(eff*(G7^2)*K_FQ)*us","v":0.254058094986526},{"$f":"(1*10^-9*(5*10^8*SQRT(fsw*kHz)+(1.09655978*10^10)*SQRT(ftyp)*SQRT(H7)))/SQRT(fsw*kHz)","v":6.89044841807498},{"$f":"(b_1^3/(27*a_1^3))-(d_1^3/27)+SQRT((ftyp)^2*H7^2/(4*a_1^2*c_1^2*(fsw*kHz)^2))+(b_1^3*(ftyp)*H7/(27*a_1^4*c_1*(fsw*kHz))-(d_1^3*(ftyp)*H7/(27*a_1*c_1*(fsw*kHz)))+(b_1*d_1^2*(ftyp)*H7/(9*a_1^2*c_1*(fsw*kHz)))-(b_1^2*d_1*(ftyp)*H7/(9*a_1^3*c_1*(fsw*kHz))))","v":8.90274534086934},{"$f":"(b_1*d_1^2/(9*a_1))-(b_1^2*d_1/(9*a_1^2))+(ftyp*H7/(2*a_1*c_1*fsw*kHz))","v":8.89854409669766},{"$f":"(d_1^2/9)+(b_1^2/(9*a_1^2))-(2*b_1*d_1/(9*a_1))","v":0.000456570969391473},{"$f":"((b_1*c_1*fsw*kHz)+(2*a_1*c_1*d_1*fsw*kHz))/(3*a_1*c_1*fsw*kHz)","v":0.521367521367521},{"$f":"(J7+K7)^(1/3)+(L7/(J7^(1/3)))+M7","v":3.13264963105569},{"$f":"(b_2^3/(27*a_2^3))-(d_2^3/27)","v":0.0732522350558588},{"$f":"(ftyp^2*H7^2/(4*a_2^2*c_2^2*(fsw*kHz)^2))+(b_2^3*ftyp*H7/(27*a_2^4*c_2*(fsw*kHz)))-(d_2^3*ftyp*H7/(27*a_2*c_2*(fsw*kHz)))+(b_2*d_2^2*ftyp*H7/(9*a_2^2*c_2*(fsw*kHz)))-(b_2^2*d_2*ftyp*H7/(9*a_2^3*c_2*(fsw*kHz)))","v":19.8352410059888},{"$f":"(b_2*d_2^2/(9*a_2))-(b_2^2*d_2/(9*a_2^2))+(ftyp*H7/(2*a_2*c_2*(fsw*kHz)))","v":4.38045999913216},{"$f":"(d_2^2/9)+(b_2^2/(9*a_2^2))-(2*b_2*d_2/(9*a_2))","v":0.0677995080076351},{"$f":"(b_2*c_2*(fsw*kHz)+2*a_2*c_2*d_2*(fsw*kHz))/(3*a_2*c_2*(fsw*kHz))","v":0.76038338658147},{"$f":"((O7+SQRT(P7)+Q7)^(1/3))+(R7/((O7+SQRT(P7)+Q7)^(1/3)))+S7","v":2.8660150459325},{"$f":"c_3+(SQRT(ftyp)*SQRT(H7)/(SQRT(a_3)*SQRT(b_3)*SQRT(fsw*kHz)))","v":2.16062303271961},{"$f":"(a_4*(fsw*kHz)*b_4/ftyp)","v":1.54877231220712},{"$f":"IF(I7>=0.5,IF(I7<1,I7,IF(N7>=1,IF(N7<2,N7,IF(T7>=2,IF(T7<4.5,T7,IF(U7>=4.5,IF(U7<4.6,U7,V7))))))))","v":2.8660150459325},{"$f":"Pin_max/G7","v":7.26744186046512},{"$f":"-X7*Rsense*1.414","v":-0.195247093023256},{"$f":"MIN(6,MAX(0.5,Beta*G*($Y7-Voff_trim)/(MAX(0,MIN(4.5,W7)-Alpha1_A)+MAX(0,MIN(4.5,W7)-Alpha1_B)-Alpha1_C)+Alpha2))","v":6}]
["fTYP",{"$f":"65*kHz","v":65000},null,"KFQ",{"$f":"1/(fsw*kHz)","v":2.0566086031066e-5},null,{"$f":"G7+1","v":173},0.251129495876287,6.85350940987801,8.80014416134043,8.7959449190408,0.000456570969391473,0.521367521367521,{"$f":"(J8+K8)^(1/3)+(L8/(J8^(1/3)))+M8","v":3.12257887564841},0.0732522350558588,19.3823685475242,4.32932430675366,0.0677995080076351,0.76038338658147,{"$f":"((O8+SQRT(P8)+Q8)^(1/3))+(R8/((O8+SQRT(P8)+Q8)^(1/3)))+S8","v":2.85817708033146},2.15102405565186,1.54877231220712,{"$f":"IF(I8>=0.5,IF(I8<1,I8,IF(N8>=1,IF(N8<2,N8,IF(T8>=2,IF(T8<4.5,T8,IF(U8>=4.5,IF(U8<4.6,U8,V8))))))))","v":2.85817708033146},7.22543352601156,-0.194118497109827,{"$f":"MIN(6,MAX(0.5,Beta*G*($Y8-Voff_trim)/(MAX(0,MIN(4.5,W8)-Alpha1_A)+MAX(0,MIN(4.5,W8)-Alpha1_B)-Alpha1_C)+Alpha2))","v":6}]
[null,null,null,"fTYP",{"$f":"65*kHz","v":65000},null,{"$f":"G8+1","v":174},0.248251244618886,6.81699498798216,8.69930687946139,8.69510960461805,0.000456570969391473,0.521367521367521,3.1126046827143,0.0732522350558588,18.9423774046268,4.27906772831931,0.0677995080076351,0.76038338658147,2.85041546461161,2.14153541165386,1.54877231220712,2.85041546461161,7.18390804597701,-0.193002873563218,6]
["M1M2",{"$f":"(Iout*(Vout_nom^2)*2.5*Rsense*K_1)/(eff*(B5^2)*K_FQ)*us","v":0.155290385993417},null,null,null,null,175,0.245422193700617,6.78089787376512,8.60019329298691,8.59599795196851,0.000456570969391473,0.521367521367521,3.10272557940511,0.0732522350558588,18.5148300582365,4.22967022731826,0.0677995080076351,0.76038338658147,2.84272903268744,2.13215520930156,1.54877231220712,2.84272903268744,7.14285714285714,-0.1919,6]
[null,null,null,"M1M2",{"$f":"((E6*Iout)*(Vout_nom^2)*2.5*Rsense*K_1)/(eff*(E5^2)*K_FQ)*us","v":0.155290385993417},null,176,0.242641228114714,6.74521095402782,8.50276433852697,8.49857089846431,0.000456570969391473,0.521367521367521,3.09294012358624,0.0732522350558588,18.0993062345919,4.18111233483694,0.0677995080076351,0.76038338658147,2.83511664280159,2.1228816001578,1.54877231220712,2.83511664280159,7.10227272727273,-0.190809659090909,6]
["VCOMP1",{"$f":"(1*10^-9*(5*10^8*SQRT(fsw*kHz)+(1.09655978*10^10)*SQRT(ftyp)*SQRT(B10)))/SQRT(fsw*kHz)","v":5.49616876322226},null,null,null,null,177,0.239907264262549,6.70992727632145,8.40698205305101,8.40279048181559,0.000456570969391473,0.521367521367521,3.08324690302621,0.0732522350558588,17.6954021326081,4.13337513037304,0.0677995080076351,0.76038338658147,2.82757717688267,2.11371277755804,1.54877231220712,2.82757717688267,7.06214689265537,-0.189731638418079,6]
[null,null,null,"VCOMP1",{"$f":"(1*10^-9*(5*10^8*SQRT(fsw*kHz)+(1.09655978*10^10)*SQRT(ftyp)*SQRT(E11)))/SQRT(fsw*kHz)","v":5.49616876322226},null,178,0.23721924889791,6.675040044432,8.31280953690174,8.30861980308504,0.000456570969391473,0.521367521367521,3.0736445346119,0.0732522350558588,17.3027296899832,4.0864402234019,0.0677995080076351,0.76038338658147,2.8201095399235,2.10464697543692,1.54877231220712,2.8201095399235,7.02247191011236,-0.188665730337079,6]
["a1",0.156,null,null,null,null,179,0.234576158112462,6.64054261401618,8.22021091825132,8.21602299114472,0.000456570969391473,0.521367521367521,3.06413166358873,0.0732522350558588,16.9209158858875,4.04028973566168,0.0677995080076351,0.76038338658147,2.81271265937911,2.09568246719426,1.54877231220712,2.81271265937911,6.98324022346369,-0.187611731843575,6]
["b1",0.088,null,"a1",0.156,null,180,0.231976996360537,6.60642848838276,8.12915131893587,8.12496516851125,0.000456570969391473,0.521367521367521,3.05470696282476,0.0732522350558588,16.5496020782207,3.99490628412551,0.0677995080076351,0.76038338658147,2.80538548458368,2.08681756459873,1.54877231220712,2.80538548458368,6.94444444444444,-0.186569444444444,6]
["c1",0.1223,null,"b1",0.088,null,181,0.229420795521547,6.57269131441379,8.03959682160771,8.03541241849873,0.000456570969391473,0.521367521367521,3.04536913209783,0.0732522350558588,16.1884433735435,3.95027296463045,0.0677995080076351,0.76038338658147,2.79812698618577,2.07805061672802,1.54877231220712,2.79812698618577,6.9060773480663,-0.185538674033149,{"$f":"MIN(6,MAX(0.5,Beta*G*($Y16-Voff_trim)/(MAX(0,MIN(4.5,W16)-Alpha1_A)+MAX(0,MIN(4.5,W16)-Alpha1_B)-Alpha1_C)+Alpha2))","v":6}]
["d1",0.5,null,"c1",0.1223,null,182,0.226906613998351,6.53932487862031,7.95151443814739,7.94733175363134,0.000456570969391473,0.521367521367521,3.03611689740493,0.0732522350558588,15.8371080279029,3.90637333613424,0.0677995080076351,0.76038338658147,2.79093615560111,2.0693800089438,1.54877231220712,2.79093615560111,6.86813186813187,-0.184519230769231,6]
["K1V2",{"$f":"(b_1^3/(27*a_1^3))-(d_1^3/27)+SQRT((ftyp)^2*B10^2/(4*a_1^2*c_1^2*(fsw*kHz)^2))+(b_1^3*(ftyp)*B10/(27*a_1^4*c_1*(fsw*kHz))-(d_1^3*(ftyp)*B10/(27*a_1*c_1*(fsw*kHz)))+(b_1*d_1^2*(ftyp)*B10/(9*a_1^2*c_1*(fsw*kHz)))-(b_1^2*d_1*(ftyp)*B10/(9*a_1^3*c_1*(fsw*kHz))))","v":5.44249589715716},null,"d1",0.5,null,183,0.224433535850022,6.5063231033273,7.86487207928079,7.86069108526106,0.000456570969391473,0.521367521367521,3.02694901029295,0.0732522350558588,15.4952768768778,3.8631914055727,0.0677995080076351,0.76038338658147,2.78381200448245,2.06080416190039,1.54877231220712,2.78381200448245,6.83060109289617,-0.183510928961748,6]
["K2V2",{"$f":"(b_1*d_1^2/(9*a_1))-(b_1^2*d_1/(9*a_1^2))+(ftyp*B10/(2*a_1*c_1*fsw*kHz))","v":5.43836216660164},null,"K1V2",{"$f":"(b_1^3/(27*a_1^3))-(d_1^3/27)+SQRT((ftyp)^2*E11^2/(4*a_1^2*c_1^2*(fsw*kHz)^2))+(b_1^3*(ftyp)*E11/(27*a_1^4*c_1*(fsw*kHz))-(d_1^3*(ftyp)*E11/(27*a_1*c_1*(fsw*kHz)))+(b_1*d_1^2*(ftyp)*E11/(9*a_1^2*c_1*(fsw*kHz)))-(b_1^2*d_1*(ftyp)*E11/(9*a_1^3*c_1*(fsw*kHz))))","v":5.44249589715716},null,184,0.222000669957508,6.47368004298313,7.77963852534885,7.77545919433797,0.000456570969391473,0.521367521367521,3.01786424721014,0.0732522350558588,15.1626427932693,3.82071161329154,0.0677995080076351,0.76038338658147,2.77675356420564,2.05232153058572,1.54877231220712,2.77675356420564,6.79347826086957,-0.182513586956522,6]
["K3V2",{"$f":"(d_1^2/9)+(b_1^2/(9*a_1^2))-(2*b_1*d_1/(9*a_1))","v":0.000456570969391473},null,"K2V2",{"$f":"(b_1*d_1^2/(9*a_1))-(b_1^2*d_1/(9*a_1^2))+(ftyp*E11/(2*a_1*c_1*fsw*kHz))","v":5.43836216660164},null,185,0.219607149220786,6.44138988058863,7.69578339818037,7.69160570328358,0.000456570969391473,0.521367521367521,3.00886140887735,0.0732522350558588,14.8389101709544,3.77891881902801,0.0677995080076351,0.76038338658147,2.76975988537153,2.04393060339336,1.54877231220712,2.76975988537153,6.75675675675676,-0.181527027027027,6]
["K4V2",{"$f":"((b_1*c_1*fsw*kHz)+(2*a_1*c_1*d_1*fsw*kHz))/(3*a_1*c_1*fsw*kHz)","v":0.521367521367521},null,"K3V2",{"$f":"(d_1^2/9)+(b_1^2/(9*a_1^2))-(2*b_1*d_1/(9*a_1))","v":0.000456570969391473},null,186,0.217252129786143,6.40944692424138,7.61327713402045,7.60910104891982,0.000456570969391473,0.521367521367521,2.99993931967851,0.0732522350558588,14.5237944335077,3.7377982884186,0.0677995080076351,0.76038338658147,2.76283003732308,2.03562990122458,1.54877231220712,2.76283003732308,6.72043010752688,-0.180551075268817,6]
["VCOMP2",{"$f":"(B18+B19)^(1/3)+(B20/(B18^(1/3)))+B21","v":2.73754863742817},null,"K4V2",{"$f":"((b_1*c_1*fsw*kHz)+(2*a_1*c_1*d_1*fsw*kHz))/(3*a_1*c_1*fsw*kHz)","v":0.521367521367521},null,187,0.214934790302307,6.37784560379089,7.53209095746965,7.52791645640868,0.000456570969391473,0.521367521367521,2.99109682706957,0.0732522350558588,14.2170215662771,3.69733568001049,0.0677995080076351,0.76038338658147,2.75596310767707,2.0274179766191,1.54877231220712,2.75596310767707,6.68449197860963,-0.179585561497326,6]
[null,null,null,"VCOMP2",{"$f":"(E19+E20)^(1/3)+(E21/(E19^(1/3)))+E22","v":2.73754863742817},null,188,0.212654331204204,6.34658046760051,7.45219685639081,7.44802391415956,0.000456570969391473,0.521367521367521,2.98233280100527,0.0732522350558588,13.9183276706773,3.65751703275534,0.0677995080076351,0.76038338658147,2.74915820186997,2.01929341291368,1.54877231220712,2.74915820186997,6.64893617021277,-0.178630319148936,6]
["a2",0.313,null,null,null,null,189,0.210409974023163,6.31564617941215,7.37356755774289,7.36939614966355,0.000456570969391473,0.521367521367521,2.97364613338314,0.0732522350558588,13.6274585395329,3.61832875396499,0.0677995080076351,0.76038338658147,2.74241444271741,2.01125482342737,1.54877231220712,2.74241444271741,6.61375661375661,-0.177685185185185,6]
["b2",0.401,null,"a2",0.313,null,190,0.208200960722476,6.28503751530998,7.29617650430268,7.29200660621559,0.000456570969391473,0.521367521367521,2.96503573750408,0.0732522350558588,13.3441692523754,3.57975760770978,0.0677995080076351,0.76038338658147,2.73573096998685,2.00330085067249,1.54877231220712,2.73573096998685,6.57894736842105,-0.17675,6]
["c2",0.1223,null,"b2",0.401,null,191,0.206026553057246,6.25474936077956,7.21999783223749,7.21582942048765,0.000456570969391473,0.521367521367521,2.95650054754893,0.0732522350558588,13.0682237896541,3.5417907036409,0.0677995080076351,0.76038338658147,2.72910693998293,1.99543016559043,1.54877231220712,2.72910693998293,6.54450261780105,-0.175824607329843,6]
["d2",0.5,null,"c2",0.1223,null,192,0.203886031957503,6.22477670785884,7.1450063494933,7.14083940091721,0.000456570969391473,0.521367521367521,2.94803951807055,0.0732522350558588,12.7993946648864,3.50441548621921,0.0677995080076351,0.76038338658147,2.722541525145,1.98764146681131,1.54877231220712,2.722541525145,6.51041666666667,-0.174908854166667,6]
["K1V3",{"$f":"(b_2^3/(27*a_2^3))-(d_2^3/27)","v":0.0732522350558588},null,"d2",0.5,null,193,0.201778696933646,6.1951146523777,7.07117751496476,7.06701200687777,0.000456570969391473,0.521367521367521,2.93965162350078,0.0732522350558588,12.5374625738243,3.46761972433374,0.0677995080076351,0.76038338658147,2.71603391365658,1.97993347993664,1.54877231220712,2.71603391365658,6.47668393782383,-0.174002590673575,6]
["K2V3",{"$f":"(ftyp^2*B10^2/(4*a_2^2*c_2^2*(fsw*kHz)^2))+(b_2^3*ftyp*B10/(27*a_2^4*c_2*(fsw*kHz)))-(d_2^3*ftyp*B10/(27*a_2*c_2*(fsw*kHz)))+(b_2*d_2^2*ftyp*B10/(9*a_2^2*c_2*(fsw*kHz)))-(b_2^2*d_2*ftyp*B10/(9*a_2^3*c_2*(fsw*kHz)))","v":7.44794105678393},null,"K1V3",{"$f":"(b_2^3/(27*a_2^3))-(d_2^3/27)","v":0.0732522350558588},null,194,0.199703865503278,6.16575839128297,6.9984874184148,6.99432332859877,0.000456570969391473,0.521367521367521,2.93133585767187,0.0732522350558588,12.2822160597672,3.43139150129373,0.0677995080076351,0.76038338658147,2.70958330906621,1.97230495684419,1.54877231220712,2.70958330906621,6.44329896907217,-0.173105670103093,6]
["K3V3",{"$f":"(b_2*d_2^2/(9*a_2))-(b_2^2*d_2/(9*a_2^2))+(ftyp*B10/(2*a_2*c_2*(fsw*kHz)))","v":2.65589648125682},null,"K2V3",{"$f":"(ftyp^2*E11^2/(4*a_2^2*c_2^2*(fsw*kHz)^2))+(b_2^3*ftyp*E11/(27*a_2^4*c_2*(fsw*kHz)))-(d_2^3*ftyp*E11/(27*a_2*c_2*(fsw*kHz)))+(b_2*d_2^2*ftyp*E11/(9*a_2^2*c_2*(fsw*kHz)))-(b_2^2*d_2*ftyp*E11/(9*a_2^3*c_2*(fsw*kHz)))","v":7.44794105678393},null,195,0.197660872638564,6.13670322004562,6.9269127611133,6.92275006780466,0.000456570969391473,0.521367521367521,2.92309123335178,0.0732522350558588,12.0334511941985,3.39571920517909,0.0677995080076351,0.76038338658147,2.70318892991927,1.96475467501422,1.54877231220712,2.70318892991927,6.41025641025641,-0.172217948717949,6]
["K4V3",{"$f":"(d_2^2/9)+(b_2^2/(9*a_2^2))-(2*b_2*d_2/(9*a_2))","v":0.0677995080076351},null,"K3V3",{"$f":"(b_2*d_2^2/(9*a_2))-(b_2^2*d_2/(9*a_2^2))+(ftyp*E11/(2*a_2*c_2*(fsw*kHz)))","v":2.65589648125682},null,196,0.195649070233272,6.10794453014743,6.85643083716531,6.85226951904353,0.000456570969391473,0.521367521367521,2.91491678179293,0.0732522350558588,11.7909712719725,3.36059151953457,0.0677995080076351,0.76038338658147,2.69685000940051,1.95728143687639,1.54877231220712,2.69685000940051,6.37755102040816,-0.171339285714286,6]
["K5V3",{"$f":"(b_2*c_2*(fsw*kHz)+2*a_2*c_2*d_2*(fsw*kHz))/(3*a_2*c_2*(fsw*kHz))","v":0.76038338658147},null,"K4V3",{"$f":"(d_2^2/9)+(b_2^2/(9*a_2^2))-(2*b_2*d_2/(9*a_2))","v":0.0677995080076351},null,197,0.193667826588714,6.07947780664415,6.78701951550126,6.78285955167761,0.000456570969391473,0.521367521367521,2.90681155229398,0.0732522350558588,11.5545865203159,3.32599741439372,0.0677995080076351,0.76038338658147,2.69056579498689,1.94988406917651,1.54877231220712,2.69056579498689,6.34517766497462,-0.170469543147208,6]
["VCOMP3",{"$f":"((B28+SQRT(B29)+B30)^(1/3))+(B31/((B28+SQRT(B29)+B30)^(1/3)))+B32","v":2.55958597404655},null,"K5V3",{"$f":"(b_2*c_2*(fsw*kHz)+2*a_2*c_2*d_2*(fsw*kHz))/(3*a_2*c_2*(fsw*kHz))","v":0.76038338658147},null,198,0.191716525917799,6.05129862580251,6.71865722250205,6.71449859250871,0.000456570969391473,0.521367521367521,2.89877461177412,0.0732522350558588,11.3241138209544,3.29192613761945,0.0677995080076351,0.76038338658147,2.68433554811034,1.94256142236249,1.54877231220712,2.68433554811034,6.31313131313131,-0.169608585858586,6]
[null,null,null,"VCOMP3",{"$f":"((E29+SQRT(E30)+E31)^(1/3))+(E32/((E29+SQRT(E30)+E31)^(1/3)))+E33","v":2.55958597404655},null,199,0.189794567866503,6.02340265280853,6.65132292523391,6.64716560901346,0.000456570969391473,0.521367521367521,2.89080504435951,0.0732522350558588,11.0993764447078,3.25836720654833,0.0677995080076351,0.76038338658147,2.67815854383008,1.93531236998881,1.54877231220712,2.67815854383008,6.28140703517588,-0.168756281407035,6]
["a3",1.007,null,null,null,null,200,0.187901367052035,5.99578563954448,6.58499611526856,6.5808400931637,0.000456570969391473,0.521367521367521,2.88290195098146,0.0732522350558588,10.8802037979361,3.22531039992673,0.0677995080076351,0.76038338658147,2.67203407051435,1.92813580813886,1.54877231220712,2.67203407051435,6.25,-0.1679125,6]
["b3",0.1223,null,"a3",1.007,null,201,0.186036352617049,5.96844342243232,6.51965679306533,6.51550204580901,0.000456570969391473,0.521367521367521,2.87506444898592,0.0732522350558588,10.6664311802509,3.19274575012695,0.0677995080076351,0.76038338658147,2.66596142953103,1.92103065486454,1.54877231220712,2.66596142953103,6.21890547263682,-0.167077114427861,6]
["c3",0.5,null,"b3",0.1223,null,202,0.184198967799269,5.94137192034107,6.45528545289331,6.45113196159903,0.000456570969391473,0.521367521367521,2.86729167175395,0.0732522350558588,10.4578995529398,3.16066353563252,0.0677995080076351,0.76038338658147,2.65993993494696,1.91399584964244,1.54877231220712,2.65993993494696,6.18811881188119,-0.16625,6]
["VCOMP4",{"$f":"c_3+(SQRT(ftyp)*SQRT(B10)/(SQRT(a_3)*SQRT(b_3)*SQRT(fsw*kHz)))","v":1.79830528012624},null,"c3",0.5,null,203,0.182388669515916,5.91456713255614,6.39186306827201,6.3877108144245,0.000456570969391473,0.521367521367521,2.8595827683328,0.0732522350558588,10.2544553175778,3.12905427378195,0.0677995080076351,0.76038338658147,2.65396891323571,1.90703035284617,1.54877231220712,2.65396891323571,6.1576354679803,-0.165431034482759,6]
[null,null,null,"VCOMP4",{"$f":"c_3+(SQRT(ftyp)*SQRT(E11)/(SQRT(a_3)*SQRT(b_3)*SQRT(fsw*kHz)))","v":1.79830528012624},null,204,{"$f":"(Iout*(Vout_nom^2)*2.5*Rsense*K_1)/(eff*(G39^2)*K_FQ)*us","v":0.180604927962355},{"$f":"(1*10^-9*(5*10^8*SQRT(fsw*kHz)+(1.09655978*10^10)*SQRT(ftyp)*SQRT(H39)))/SQRT(fsw*kHz)","v":5.88802513680832},{"$f":"(b_1^3/(27*a_1^3))-(d_1^3/27)+SQRT((ftyp)^2*H39^2/(4*a_1^2*c_1^2*(fsw*kHz)^2))+(b_1^3*(ftyp)*H39/(27*a_1^4*c_1*(fsw*kHz))-(d_1^3*(ftyp)*H39/(27*a_1*c_1*(fsw*kHz)))+(b_1*d_1^2*(ftyp)*H39/(9*a_1^2*c_1*(fsw*kHz)))-(b_1^2*d_1*(ftyp)*H39/(9*a_1^3*c_1*(fsw*kHz))))","v":6.32937107791041},{"$f":"(b_1*d_1^2/(9*a_1))-(b_1^2*d_1/(9*a_1^2))+(ftyp*H39/(2*a_1*c_1*fsw*kHz))","v":6.32522004335658},{"$f":"(d_1^2/9)+(b_1^2/(9*a_1^2))-(2*b_1*d_1/(9*a_1))","v":0.000456570969391473},{"$f":"((b_1*c_1*fsw*kHz)+(2*a_1*c_1*d_1*fsw*kHz))/(3*a_1*c_1*fsw*kHz)","v":0.521367521367521},2.85193690307724,{"$f":"(b_2^3/(27*a_2^3))-(d_2^3/27)","v":0.0732522350558588},{"$f":"(ftyp^2*H39^2/(4*a_2^2*c_2^2*(fsw*kHz)^2))+(b_2^3*ftyp*H39/(27*a_2^4*c_2*(fsw*kHz)))-(d_2^3*ftyp*H39/(27*a_2*c_2*(fsw*kHz)))+(b_2*d_2^2*ftyp*H39/(9*a_2^2*c_2*(fsw*kHz)))-(b_2^2*d_2*ftyp*H39/(9*a_2^3*c_2*(fsw*kHz)))","v":10.0559501043331},{"$f":"(b_2*d_2^2/(9*a_2))-(b_2^2*d_2/(9*a_2^2))+(ftyp*H39/(2*a_2*c_2*(fsw*kHz)))","v":3.09790871376088},{"$f":"(d_2^2/9)+(b_2^2/(9*a_2^2))-(2*b_2*d_2/(9*a_2))","v":0.0677995080076351},{"$f":"(b_2*c_2*(fsw*kHz)+2*a_2*c_2*d_2*(fsw*kHz))/(3*a_2*c_2*(fsw*kHz))","v":0.76038338658147},2.64804770299343,{"$f":"c_3+(SQRT(ftyp)*SQRT(H39)/(SQRT(a_3)*SQRT(b_3)*SQRT(fsw*kHz)))","v":1.90013314523418},{"$f":"(a_4*(fsw*kHz)*b_4/ftyp)","v":1.54877231220712},2.64804770299343,{"$f":"Pin_max/G39","v":6.12745098039216},{"$f":"-X39*Rsense*1.414","v":-0.164620098039216},{"$f":"MIN(6,MAX(0.5,Beta*G*($Y39-Voff_trim)/(MAX(0,MIN(4.5,W39)-Alpha1_A)+MAX(0,MIN(4.5,W39)-Alpha1_B)-Alpha1_C)+Alpha2))","v":6}]
["a4",1.007,null,null,null,null,205,0.178847226224423,5.86174208736047,6.26779137212502,6.2636415390651,0.000456570969391473,0.521367521367521,2.8443532553008,0.0732522350558588,9.86224056949492,3.06721782983286,0.0677995080076351,0.76038338658147,2.64217565466256,1.89330322745255,1.54877231220712,2.64217565466256,6.09756097560976,-0.163817073170732,6]
["b4",2.056,null,"a4",1.007,null,206,0.177115059903888,5.83571421314998,6.20710627971828,6.20295763069728,0.000456570969391473,0.521367521367521,2.83683101893662,0.0732522350558588,9.67318820178177,3.0369728147997,0.0677995080076351,0.76038338658147,2.63635213026319,1.88653961955229,1.54877231220712,2.63635213026319,6.06796116504854,-0.163021844660194,6]
["VCOMP5",{"$f":"(a_4*(fsw*kHz)*b_4/ftyp)","v":1.54877231220712},null,"b4",2.056,null,207,0.175407936756549,5.80993781598501,6.14729855529958,6.14315107319901,0.000456570969391473,0.521367521367521,2.82936940220761,0.0732522350558588,9.4886591370067,3.00716507368235,0.0677995080076351,0.76038338658147,2.63057650313175,1.87984136052064,1.54877231220712,2.63057650313175,6.03864734299517,-0.162234299516908,6]
[null,null,null,"VCOMP5",{"$f":"(a_4*(fsw*kHz)*b_4/ftyp)","v":1.54877231220712},null,208,0.173725376342488,5.78440926879277,6.08835136703205,6.08420503506181,0.000456570969391473,0.521367521367521,2.82196762730557,0.0732522350558588,9.30852398070266,2.97778621761397,0.0677995080076351,0.76038338658147,2.6248481576668,1.87320750782583,1.54877231220712,2.6248481576668,6.00961538461539,-0.161454326923077,6]
["VCOMP =",{"$f":"IF(B12>=0.5,IF(B12<1,B12,IF(B22>=1,IF(B22<2,B22,IF(B33>=2,IF(B33<4.5,B33,IF(B38>=4.5,IF(B38<4.6,B38,B42))))))))","v":2.55958597404655},null,null,null,null,209,0.172066909687997,5.75912501391816,6.03024828478867,6.02610308647924,0.000456570969391473,0.521367521367521,2.81462493007905,0.0732522350558588,9.13265763832875,2.94882805793703,0.0677995080076351,0.76038338658147,2.61916648908181,1.86663713697499,1.54877231220712,2.61916648908181,5.98086124401914,-0.160681818181818,6]
["ICOMP =",{"$f":"MIN(6,MAX(0.5,Beta*G*((Pin_max*Rsense*-1.414/B5)-Voff_trim)/(MAX(0,MIN(4.5,B44)-Alpha1_A)+MAX(0,MIN(4.5,B44)-Alpha1_B)-Alpha1_C)+Alpha2))","v":6},null,"VCOMP =",{"$f":"IF(E13>=0.5,IF(E13<1,E13,IF(E23>=1,IF(E23<2,E23,IF(E34>=2,IF(E34<4.5,E34,IF(E39>=4.5,IF(E39<4.6,E39,E43))))))))","v":2.55958597404655},null,210,0.170432078958762,5.73408156147094,5.97297326870224,5.96882918789706,0.000456570969391473,0.521367521367521,2.80734055972961,0.0732522350558588,8.96093915269952,2.92028260049671,0.0677995080076351,0.76038338658147,2.6135309031645,1.86012934108463,1.54877231220712,2.6135309031645,5.95238095238095,-0.159916666666667,6]
[null,null,null,null,null,null,211,0.168820437143851,5.70927548771989,5.91651065809439,5.91236767894245,0.000456570969391473,0.521367521367521,2.80011377851627,0.0732522350558588,8.79325154829731,2.89214204012316,0.0677995080076351,0.76038338658147,2.60794081604274,1.85368323046338,1.54877231220712,2.60794081604274,5.92417061611374,-0.159158767772512,6]
[null,null,null,null,null,null,212,0.16723154775012,5.68470343353253,5.86084516076912,5.85670326771779,0.000456570969391473,0.521367521367521,2.79294386146784,0.0732522350558588,8.62948168214534,2.86439875529554,0.0677995080076351,0.76038338658147,2.60239565395668,1.84729793220647,1.54877231220712,2.60239565395668,5.89622641509434,-0.158408018867925,6]
[null,null,null,null,null,null,213,0.165664984506632,5.66036210285867,5.80596184265756,5.80182102044558,0.000456570969391473,0.521367521367521,2.78583009610293,0.0732522350558588,8.46952010093594,2.83704530298096,0.0677995080076351,0.76038338658147,2.59689485303694,1.84097258980175,1.54877231220712,2.59689485303694,5.86854460093897,-0.157664319248826,6]
[null,null,null,null,null,null,214,0.164120331078727,5.63624826125653,5.75184611780048,5.74770635145118,0.000456570969391473,0.521367521367521,2.77877178215739,0.0732522350558588,8.31326090412341,2.8100744136419,0.0677995080076351,0.76038338658147,2.59143785908868,1.8347063627466,1.54877231220712,2.59143785908868,5.8411214953271,-0.156927570093458,6]
[null,null,null,null,null,null,215,0.162597180791377,5.61235873445998,5.69848373865628,5.69434501347099,0.000456570969391473,0.521367521367521,2.77176823131889,0.0732522350558588,8.16060161270638,2.78347898640576,0.0677995080076351,0.76038338658147,2.58602412738141,1.82849842617568,1.54877231220712,2.58602412738141,5.81395348837209,-0.156197674418605,6]
[null,null,null,null,null,null,216,0.161095136361484,5.58869040698563,5.64586078672235,5.64172308827397,0.000456570969391473,0.521367521367521,2.76481876696851,0.0732522350558588,8.01144304343802,2.75725208439063,0.0677995080076351,0.76038338658147,2.58065312244427,1.82234797049895,1.54877231220712,2.58065312244427,5.78703703703704,-0.155474537037037,6]
[null,null,null,null,null,null,217,0.159613809638799,5.56524022077832,5.59396366345826,5.58982697758498,0.000456570969391473,0.521367521367521,2.75792272392911,0.0732522350558588,7.86568918821568,2.73138693018143,0.0677995080076351,0.76038338658147,2.57532431786665,1.81625420104964,1.54877231220712,2.57532431786665,5.76036866359447,-0.154758064516129,6]
[null,null,null,null,null,null,218,0.158152821355134,5.54200517389402,5.54277908149967,5.53864339429896,0.000456570969391473,0.521367521367521,2.75107944822016,0.0732522350558588,7.72324709841421,2.70587690145101,0.0677995080076351,0.76038338658147,2.57003719610405,1.81021633774207,1.54877231220712,2.57003719610405,5.73394495412844,-0.154048165137615,6]
[null,null,null,null,null,null,219,0.156711800881579,5.51898231921871,5.4922940561525,5.48815935397519,0.000456570969391473,0.521367521367521,2.74428829681898,0.0732522350558588,7.58402677393876,2.68071552672095,0.0677995080076351,0.76038338658147,2.56479124828895,1.80423361473869,1.54877231220712,2.56479124828895,5.70776255707763,-0.153344748858448,6]
[null,null,null,null,null,null,220,0.155290385993417,5.49616876322226,5.44249589715716,5.43836216660164,0.000456570969391473,0.521367521367521,2.73754863742817,0.0732522350558588,7.44794105678393,2.65589648125682,0.0677995080076351,0.76038338658147,2.55958597404655,1.79830528012624,1.54877231220712,2.55958597404655,5.68181818181818,-0.152647727272727,6]
[null,null,null,null,null,null,221,0.15388822264248,5.47356166474614,5.3933722007129,5.38923942861961,0.000456570969391473,0.521367521367521,2.73085984824888,0.0732522350558588,7.31490552889699,2.63141358309325,0.0677995080076351,0.76038338658147,2.55442088131519,1.79243059560078,1.54877231220712,2.55442088131519,5.65610859728507,-0.151957013574661,6]
[null,null,null,null,null,null,222,0.152504964736657,5.45115823382386,5.34491084175325,5.34077901519919,0.000456570969391473,0.521367521367521,2.72422131776003,0.0732522350558588,7.18483841415248,2.60726078918403,0.0677995080076351,0.76038338658147,2.54929548617148,1.78660883616114,1.54877231220712,2.54929548617148,5.63063063063063,-0.151272522522522,6]
[null,null,null,null,null,null,223,0.151140273926308,5.42895573053317,5.29709996646327,5.29296907275672,0.000456570969391473,0.521367521367521,2.71763244450302,0.0732522350558588,7.0576604842552,2.58343219167277,0.0677995080076351,0.76038338658147,2.54420931265975,1.78083928981064,1.54877231220712,2.54420931265975,5.60538116591928,-0.150594170403587,6]
[null,null,null,null,null,null,224,0.149793819397349,5.406951463879,5.24992798503015,5.24579801170552,0.000456570969391473,0.521367521367521,2.71109263687196,0.0732522350558588,6.9332949683974,2.55992201427984,0.0677995080076351,0.76038338658147,2.53916189262589,1.77512125726684,1.54877231220712,2.53916189262589,5.58035714285714,-0.149921875,6]
[null,null,null,null,null,null,225,0.148465277670743,5.38514279070621,5.20338356461885,5.19925449943169,0.000456570969391473,0.521367521367521,2.70460131290916,0.0732522350558588,6.81166746650444,2.53672460880151,0.0677995080076351,0.76038338658147,2.53415276555538,1.76945405167899,1.54877231220712,2.53415276555538,5.55555555555556,-0.149255555555556,6]
[null,null,null,null,null,null,226,0.147154332408203,5.36352711464113,5.15745562256485,5.15332745348691,0.000456570969391473,0.521367521367521,2.69815790010575,0.0732522350558588,6.69270586591124,2.51383445171721,0.0677995080076351,0.76038338658147,2.52918147841533,1.76383699835297,1.54877231220712,2.52918147841533,5.53097345132743,-0.148595132743363,6]
[null,null,null,null,null,null,227,0.145860674223862,5.34210188506122,5.11213331977627,5.10800603499081,0.000456570969391473,0.521367521367521,2.69176183520728,0.0732522350558588,6.57634026131949,2.49124614090126,0.0677995080076351,0.76038338658147,2.52424758550054,1.75826943448358,1.54877231220712,2.52424758550054,5.50660792951542,-0.147940528634361,6]
[null,null,null,null,null,null,228,0.144584000501719,5.32086459609165,5.06740605433819,5.06327964223531,0.000456570969391473,0.521367521367521,2.68541256402419,0.0732522350558588,6.46250287789257,2.46895439243526,0.0677995080076351,0.76038338658147,2.51935064828332,1.75275070889374,1.54877231220712,2.51935064828332,5.48245614035088,-0.147291666666667,6]
[null,null,null,null,null,null,229,0.143324015218653,5.29981278562837,5.02326345531202,5.01913790448419,0.000456570969391473,0.521367521367521,2.67910954124693,0.0732522350558588,6.35112799735224,2.44695403751777,0.0677995080076351,0.76038338658147,2.5144902352671,1.74728018178066,1.54877231220712,2.5144902352671,5.45851528384279,-0.14664847161572,6]
[null,null,null,null,null,null,230,0.142080428772805,5.27894403438651,4.97969537672316,4.97557067596078,0.000456570969391473,0.521367521367521,2.67285223026564,0.0732522350558588,6.24215188694733,2.42524001946777,0.0677995080076351,0.76038338658147,2.50966592184359,1.74185722446857,1.54877231220712,2.50966592184359,5.43478260869565,-0.146010869565217,6]
[null,null,null,null,null,null,231,0.140852957817158,5.25825596497358,4.93669189173045,4.93256803001764,0.000456570969391473,0.521367521367521,2.66664010299431,0.0732522350558588,6.13551273117102,2.40380739081879,0.0677995080076351,0.76038338658147,2.50487729015348,1.73648121916785,1.54877231220712,2.50487729015348,5.41125541125541,-0.145378787878788,6]
[null,null,null,null,null,null,232,0.139641325098123,5.23774624098662,4.89424328697121,4.89012025348157,0.000456570969391473,0.521367521367521,2.66047263969915,0.0732522350558588,6.03115056610905,2.38265131050049,0.0677995080076351,0.76038338658147,2.50012392895051,1.7311515587404,1.54877231220712,2.50012392895051,5.38793103448276,-0.144752155172414,6]
[null,null,null,null,null,null,233,0.138445259298963,5.2174125661326,4.85234005707572,4.84821784116836,0.000456570969391473,0.521367521367521,2.65434932883123,0.0732522350558588,5.92900721630661,2.36176704110477,0.0677995080076351,0.76038338658147,2.49540543346893,1.72586764647113,1.54877231220712,2.49540543346893,5.36480686695279,-0.144130901287554,6]
[null,null,null,null,null,null,234,0.137264494887891,5.19725268337135,4.81097289934557,4.80685149056105,0.000456570969391473,0.521367521367521,2.64826966686309,0.0732522350558588,5.8290262340471,2.3411499462334,0.0677995080076351,0.76038338658147,2.49072140529406,1.72062889584518,1.54877231220712,2.49072140529406,5.34188034188034,-0.143514957264957,6]
[null,null,null,null,null,null,235,0.136098771970691,5.17726437408041,4.77013270859002,4.7660120966466,0.000456570969391473,0.521367521367521,2.64223315812938,0.0732522350558588,5.73115284094068,2.3207954879246,0.0677995080076351,0.76038338658147,2.48607145223608,1.71543473033095,1.54877231220712,2.48607145223608,5.31914893617021,-0.142904255319149,6]
[null,null,null,null,null,null,236,{"$f":"(Iout*(Vout_nom^2)*2.5*Rsense*K_1)/(eff*(G71^2)*K_FQ)*us","v":0.134947836147684},{"$f":"(1*10^-9*(5*10^8*SQRT(fsw*kHz)+(1.09655978*10^10)*SQRT(ftyp)*SQRT(H71)))/SQRT(fsw*kHz)","v":5.15744545724109},{"$f":"(b_1^3/(27*a_1^3))-(d_1^3/27)+SQRT((ftyp)^2*H71^2/(4*a_1^2*c_1^2*(fsw*kHz)^2))+(b_1^3*(ftyp)*H71/(27*a_1^4*c_1*(fsw*kHz))-(d_1^3*(ftyp)*H71/(27*a_1*c_1*(fsw*kHz)))+(b_1*d_1^2*(ftyp)*H71/(9*a_1^2*c_1*(fsw*kHz)))-(b_1^2*d_1*(ftyp)*H71/(9*a_1^3*c_1*(fsw*kHz))))","v":4.72981057211537},{"$f":"(b_1*d_1^2/(9*a_1))-(b_1^2*d_1/(9*a_1^2))+(ftyp*H71/(2*a_1*c_1*fsw*kHz))","v":4.72569074690519},{"$f":"(d_1^2/9)+(b_1^2/(9*a_1^2))-(2*b_1*d_1/(9*a_1))","v":0.000456570969391473},{"$f":"((b_1*c_1*fsw*kHz)+(2*a_1*c_1*d_1*fsw*kHz))/(3*a_1*c_1*fsw*kHz)","v":0.521367521367521},2.63623931467125,{"$f":"(b_2^3/(27*a_2^3))-(d_2^3/27)","v":0.0732522350558588},{"$f":"(ftyp^2*H71^2/(4*a_2^2*c_2^2*(fsw*kHz)^2))+(b_2^3*ftyp*H71/(27*a_2^4*c_2*(fsw*kHz)))-(d_2^3*ftyp*H71/(27*a_2*c_2*(fsw*kHz)))+(b_2*d_2^2*ftyp*H71/(9*a_2^2*c_2*(fsw*kHz)))-(b_2^2*d_2*ftyp*H71/(9*a_2^3*c_2*(fsw*kHz)))","v":5.63533387172555},{"$f":"(b_2*d_2^2/(9*a_2))-(b_2^2*d_2/(9*a_2^2))+(ftyp*H71/(2*a_2*c_2*(fsw*kHz)))","v":2.30069922415572},{"$f":"(d_2^2/9)+(b_2^2/(9*a_2^2))-(2*b_2*d_2/(9*a_2))","v":0.0677995080076351},{"$f":"(b_2*c_2*(fsw*kHz)+2*a_2*c_2*d_2*(fsw*kHz))/(3*a_2*c_2*(fsw*kHz))","v":0.76038338658147},2.48145518820678,{"$f":"c_3+(SQRT(ftyp)*SQRT(H71)/(SQRT(a_3)*SQRT(b_3)*SQRT(fsw*kHz)))","v":1.71028458316853},{"$f":"(a_4*(fsw*kHz)*b_4/ftyp)","v":1.54877231220712},2.48145518820678,{"$f":"Pin_max/G71","v":5.29661016949153},{"$f":"-X71*Rsense*1.414","v":-0.142298728813559},{"$f":"MIN(6,MAX(0.5,Beta*G*($Y71-Voff_trim)/(MAX(0,MIN(4.5,W71)-Alpha1_A)+MAX(0,MIN(4.5,W71)-Alpha1_B)-Alpha1_C)+Alpha2))","v":6}]
[null,null,null,null,null,null,237,0.133811438374929,5.13779378864513,4.6899977648619,4.68587871644733,0.000456570969391473,0.521367521367521,{"$f":"(J72+K72)^(1/3)+(L72/(J72^(1/3)))+M72","v":2.6302876560845},0.0732522350558588,5.54151772018895,2.28085680641953,0.0677995080076351,0.76038338658147,{"$f":"((O72+SQRT(P72)+Q72)^(1/3))+(R72/((O72+SQRT(P72)+Q72)^(1/3)))+S72","v":2.47687223309927},1.7051778971636,1.54877231220712,{"$f":"IF(I72>=0.5,IF(I72<1,I72,IF(N72>=1,IF(N72<2,N72,IF(T72>=2,IF(T72<4.5,T72,IF(U72>=4.5,IF(U72<4.6,U72,V72))))))))","v":2.47687223309927},5.27426160337553,-0.141698312236287,6]
[null,null,null,null,null,null,{"$f":"G72+1","v":238},0.132689334829486,5.11830726012141,4.65068574468353,4.64656746329362,0.000456570969391473,0.521367521367521,2.62437770937137,0.0732522350558588,5.44965428711978,2.26126397737167,0.0677995080076351,0.76038338658147,2.47232221267062,1.70011412448644,1.54877231220712,2.47232221267062,5.25210084033613,-0.14110294117647,6]
[null,null,null,null,null,null,239,0.131581286778617,5.09898379878199,4.61186614776556,4.60774862379254,0.000456570969391473,0.521367521367521,2.61850900879579,0.0732522350558588,5.35969493020799,2.24191656854685,0.0677995080076351,0.76038338658147,2.4678047584272,1.69509272647603,1.54877231220712,2.4678047584272,5.23012552301255,-0.140512552301255,6]
[null,null,null,null,null,null,240,0.130487060452802,5.07982136628707,4.57353078417561,4.5694140081715,0.000456570969391473,0.521367521367521,2.61268109574212,0.0732522350558588,5.27159241581041,2.22281049814148,0.0677995080076351,0.76038338658147,2.46331950751278,1.69011317344905,1.54877231220712,2.46331950751278,5.20833333333333,-0.139927083333333,6]
[null,null,null,null,null,null,241,0.129406426922425,5.0608179581282,4.53567163354366,4.53155559621699,0.000456570969391473,0.521367521367521,2.60689351857711,0.0732522350558588,5.18530087250602,2.20394176886064,0.0677995080076351,0.76038338658147,2.45886610259923,1.68517494451358,1.54877231220712,2.45886610259923,5.18672199170125,-0.139346473029046,6]
[null,null,null,null,null,null,242,0.128339161978031,5.04197160292933,4.49828084086675,4.49416553307928,0.000456570969391473,0.521367521367521,2.60114583251524,0.0732522350558588,5.10077574636709,2.18530646582714,0.0677995080076351,0.76038338658147,2.45444419177983,1.68027752738749,1.54877231220712,2.45444419177983,5.16528925619835,-0.138770661157025,6]
[null,null,null,null,null,null,243,0.127285046014012,5.02328036176501,4.4613507124342,4.45723612519782,0.000456570969391473,0.521367521367521,2.59543759948707,0.0732522350558588,5.01797375787626,2.16690075455076,0.0677995080076351,0.76038338658147,2.45005342846506,1.67542041822129,1.54877231220712,2.45005342846506,5.1440329218107,-0.138199588477366,6]
[null,null,null,null,null,null,244,0.126243863915637,5.00474232749548,4.42487371186962,4.42075983634327,0.000456570969391473,0.521367521367521,2.58976838801072,0.0732522350558588,4.93685286042222,2.14872087895552,0.0677995080076351,0.76038338658147,2.44569347128072,1.6706031214253,1.54877231220712,2.44569347128072,5.12295081967213,-0.137633196721311,6]
[null,null,null,null,null,null,245,0.125215404949294,4.98635562411794,4.3888424562857,4.38472928377235,0.000456570969391473,0.521367521367521,2.58413777306629,0.0732522350558588,4.85737220031025,2.13076315946331,0.0677995080076351,0.76038338658147,2.44136398396857,1.66582514950111,1.54877231220712,2.44136398396857,5.10204081632653,-0.137071428571429,6]
[null,null,null,null,null,null,246,0.124199462655849,4.96811840613373,4.35324971254815,4.34913723449192,0.000456570969391473,0.521367521367521,2.57854533597322,0.0732522350558588,4.77949207822633,2.11302399113185,0.0677995080076351,0.76038338658147,2.43706463528912,1.66108602287712,1.54877231220712,2.43706463528912,5.08130081300813,-0.136514227642276,6]
[null,null,null,null,null,null,{"$f":"G81+1","v":247},0.123195834747027,4.95002885793075,4.31808839364545,4.31397660162871,0.000456570969391473,0.521367521367521,2.57299066427041,0.0732522350558588,4.70317391209627,2.09549984184539,0.0677995080076351,0.76038338658147,2.43279509892672,1.65638526974807,1.54877231220712,2.43279509892672,5.06072874493927,-0.135961538461538,6]
[null,null,null,null,null,null,248,0.122204323004705,4.93208519318103,4.28335155516068,4.27924044090132,0.000456570969391473,0.521367521367521,2.56747335159913,0.0732522350558588,4.62838020128406,2.07818725055634,0.0677995080076351,0.76038338658147,2.42855505339683,1.65172242591844,1.54877231220712,2.42855505339683,5.04032258064516,-0.135413306451613,6]
[null,null,null,null,null,null,249,0.121224733183036,4.9142856542526,4.24903239184249,4.24492194719115,0.000456570969391473,0.521367521367521,2.56199299758856,0.0732522350558588,4.55507449207601,2.06108282557619,0.0677995080076351,0.76038338658147,2.42434418195533,1.64709703464969,1.54877231220712,2.42434418195533,5.02008032128514,-0.134869477911647,6]
[null,null,null,null,null,null,250,0.120256874913302,4.89662851163559,4.21512423427177,4.21101445120925,0.000456570969391473,0.521367521367521,2.55654920774393,0.0732522350558588,4.48322134439945,2.04418324291429,0.0677995080076351,0.76038338658147,2.42016217250999,1.64250864651109,1.54877231220712,2.42016217250999,5,-0.13433,6]
[null,null,null,null,null,null,251,0.119300561611425,4.87911206338206,4.1816205456212,4.17751141625583,0.000456570969391473,0.521367521367521,2.55114159333722,0.0732522350558588,4.41278629972724,2.02748524466274,0.0677995080076351,0.76038338658147,2.41600871753387,1.63795681923415,1.54877231220712,2.41600871753387,4.9800796812749,-0.133794820717131,6]
[null,null,null,null,null,null,252,0.118355610388029,4.86173463455911,4.14851491850455,4.14440643506966,0.000456570969391473,0.521367521367521,2.5457697713003,0.0732522350558588,4.34373585012126,2.01098563742619,0.0677995080076351,0.76038338658147,2.41188351398066,1.63344111757052,1.54877231220712,2.41188351398066,4.96031746031746,-0.133263888888889,6]
[null,null,null,null,null,null,253,0.117421841960996,4.84449457671501,4.11580107191303,4.11169322676452,0.000456570969391473,0.521367521367521,2.54043336412045,0.0732522350558588,4.2760374083702,1.99468129079487,0.0677995080076351,0.76038338658147,2.40778626320199,1.62896111315325,1.54877231220712,2.40778626320199,4.94071146245059,-0.132737154150198,6]
[null,null,null,null,null,null,254,0.116499080570423,4.82739026735786,4.08347284823587,4.07936563384977,0.000456570969391473,0.521367521367521,2.5351319997382,0.0732522350558588,4.20965927917867,1.97856913585972,0.0677995080076351,0.76038338658147,2.40371667086651,1.62451638436131,1.54877231220712,2.40371667086651,4.92125984251969,-0.132214566929134,6]
[null,null,null,null,null,null,255,0.115587153895908,4.81042010944665,4.05152421036256,4.04741761933269,0.000456570969391473,0.521367521367521,2.52986531144752,0.0732522350558588,4.14457063136692,1.96264616376814,0.0677995080076351,0.76038338658147,2.39967444688081,1.62010651618734,1.54877231220712,2.39967444688081,4.90196078431373,-0.131696078431373,6]
[null,null,null,null,null,null,256,0.114685892976095,4.79358253089413,4.01994923886416,4.01584326389985,0.000456570969391473,0.521367521367521,2.52463293779812,0.0732522350558588,4.08074147104173,1.94690942431919,0.0677995080076351,0.76038338658147,2.39565930531207,1.61573110010849,1.54877231220712,2.39565930531207,4.8828125,-0.131181640625,6]
[null,null,null,null,null,null,257,0.113795132130409,4.77687598408131,3.98874212925122,3.98463676317505,0.000456570969391473,0.521367521367521,2.51943452249998,0.0732522350558588,4.01814261570093,1.93135602459692,0.0677995080076351,0.76038338658147,2.39167096431247,1.6113897339602,1.54877231220712,2.39167096431247,4.86381322957198,-0.130671206225681,6]
[null,null,null,null,null,null,258,0.1129147088829,4.76029894538332,3.95789718930597,3.95379242505156,0.000456570969391473,0.521367521367521,2.51426971432995,0.0732522350558588,3.95674566923571,1.91598312764081,0.0677995080076351,0.76038338658147,2.38770914604517,1.60708202181307,1.54877231220712,2.38770914604517,4.84496124031008,-0.130164728682171,6]
[null,null,null,null,null,null,259,0.112044463888156,4.74384991470617,3.92740883648644,3.92330466709636,0.000456570969391473,0.521367521367521,2.50913816704037,0.0732522350558588,3.89652299779615,1.90078795115195,0.0677995080076351,0.76038338658147,2.38377357661202,1.6028075738524,1.54877231220712,2.38377357661202,4.82625482625483,-0.129662162162162,6]
[null,null,null,null,null,null,260,0.111184240859192,4.72752741503422,3.89727159540041,3.89316801402404,0.000456570969391473,0.521367521367521,2.50403953926974,0.0732522350558588,3.83744770648697,1.88576776623412,0.0677995080076351,0.76038338658147,2.37986398598272,1.59856600626066,1.54877231220712,2.37986398598272,4.80769230769231,-0.129163461538462,6]
[null,null,null,null,null,null,261,0.110333886497283,4.71132999198811,3.86748009534687,3.8633770952384,0.000456570969391473,0.521367521367521,2.49897349445527,0.0732522350558588,3.77949361686198,1.87091989616843,0.0677995080076351,0.76038338658147,2.37598010792565,1.59435694110258,1.54877231220712,2.37598010792565,4.78927203065134,-0.128668582375479,6]
[null,null,null,null,null,null,262,0.109493250423655,4.69525621339274,3.83802906792316,3.83392664243955,0.000456570969391473,0.521367521367521,2.49393970074741,0.0732522350558588,3.72263524518686,1.85624171522076,0.0677995080076351,0.76038338658147,2.37212167994012,1.59018000621287,1.54877231220712,2.37212167994012,4.77099236641221,-0.12817748091603,6]
[null,null,null,null,null,null,263,0.108662185113004,4.67930466885512,3.80891334469555,3.80481148729461,0.000456570969391473,0.521367521367521,2.48893783092606,0.0732522350558588,3.66684778144116,1.84173064748079,0.0677995080076351,0.76038338658147,2.36828844319009,1.58603483508659,1.54877231220712,2.36828844319009,4.75285171102662,-0.127690114068441,6]
[null,null,null,null,null,null,264,0.107840545828762,4.66347396935188,3.78012785493158,3.77602655917007,0.000456570969391473,0.521367521367521,2.48396756231881,0.0732522350558588,3.61210706903192,1.82738416573182,0.0677995080076351,0.76038338658147,2.3644801424393,1.58192106677186,1.54877231220712,2.3644801424393,4.73484848484848,-0.127206439393939,6]
[null,null,null,null,null,null,265,0.107028190560077,4.64776274682603,3.75166762339213,3.74756688292387,0.000456570969391473,0.521367521367521,2.47902857672069,0.0732522350558588,3.55838958519188,1.81319979035033,0.0677995080076351,0.76038338658147,2.36069652598788,1.57783834576518,1.54877231220712,2.36069652598788,4.71698113207547,-0.12672641509434,6]
[null,null,null,null,null,null,{"$f":"G100+1","v":266},0.106224979960447,4.63216965379284,3.7235277681815,3.71942757675555,0.000456570969391473,0.521367521367521,2.47412056031583,0.0732522350558588,3.50567242203704,1.79917508823449,0.0677995080076351,0.76038338658147,2.35693734561015,1.57378632190892,1.54877231220712,2.35693734561015,4.69924812030075,-0.12625,6]
[null,null,null,null,null,null,267,0.10543077728796,4.61669336295467,3.6957034986537,3.69160385011262,0.000456570969391473,0.521367521367521,2.46924320360065,0.0732522350558588,3.45393326825874,1.78530767176069,0.0677995080076351,0.76038338658147,2.35320235649392,1.56976465029128,1.54877231220712,2.35320235649392,4.68164794007491,-0.125777153558053,6]
[null,null,null,null,null,null,268,{"$f":"(Iout*(Vout_nom^2)*2.5*Rsense*K_1)/(eff*(G103^2)*K_FQ)*us","v":0.10464544834709},{"$f":"(1*10^-9*(5*10^8*SQRT(fsw*kHz)+(1.09655978*10^10)*SQRT(ftyp)*SQRT(H103)))/SQRT(fsw*kHz)","v":4.60133256682424},{"$f":"(b_1^3/(27*a_1^3))-(d_1^3/27)+SQRT((ftyp)^2*H103^2/(4*a_1^2*c_1^2*(fsw*kHz)^2))+(b_1^3*(ftyp)*H103/(27*a_1^4*c_1*(fsw*kHz))-(d_1^3*(ftyp)*H103/(27*a_1*c_1*(fsw*kHz)))+(b_1*d_1^2*(ftyp)*H103/(9*a_1^2*c_1*(fsw*kHz)))-(b_1^2*d_1*(ftyp)*H103/(9*a_1^3*c_1*(fsw*kHz))))","v":3.66819011337343},{"$f":"(b_1*d_1^2/(9*a_1))-(b_1^2*d_1/(9*a_1^2))+(ftyp*H103/(2*a_1*c_1*fsw*kHz))","v":3.66409100165149},{"$f":"(d_1^2/9)+(b_1^2/(9*a_1^2))-(2*b_1*d_1/(9*a_1))","v":0.000456570969391473},{"$f":"((b_1*c_1*fsw*kHz)+(2*a_1*c_1*d_1*fsw*kHz))/(3*a_1*c_1*fsw*kHz)","v":0.521367521367521},2.46439620130873,{"$f":"(b_2^3/(27*a_2^3))-(d_2^3/27)","v":0.0732522350558588},{"$f":"(ftyp^2*H103^2/(4*a_2^2*c_2^2*(fsw*kHz)^2))+(b_2^3*ftyp*H103/(27*a_2^4*c_2*(fsw*kHz)))-(d_2^3*ftyp*H103/(27*a_2*c_2*(fsw*kHz)))+(b_2*d_2^2*ftyp*H103/(9*a_2^2*c_2*(fsw*kHz)))-(b_2^2*d_2*ftyp*H103/(9*a_2^3*c_2*(fsw*kHz)))","v":3.40315039142694},{"$f":"(b_2*d_2^2/(9*a_2))-(b_2^2*d_2/(9*a_2^2))+(ftyp*H103/(2*a_2*c_2*(fsw*kHz)))","v":1.77159519776729},{"$f":"(d_2^2/9)+(b_2^2/(9*a_2^2))-(2*b_2*d_2/(9*a_2))","v":0.0677995080076351},{"$f":"(b_2*c_2*(fsw*kHz)+2*a_2*c_2*d_2*(fsw*kHz))/(3*a_2*c_2*(fsw*kHz))","v":0.76038338658147},2.34949131718091,{"$f":"c_3+(SQRT(ftyp)*SQRT(H103)/(SQRT(a_3)*SQRT(b_3)*SQRT(fsw*kHz)))","v":1.5657729911484},{"$f":"(a_4*(fsw*kHz)*b_4/ftyp)","v":1.54877231220712},2.34949131718091,{"$f":"Pin_max/G103","v":4.66417910447761},{"$f":"-X103*Rsense*1.414","v":-0.125307835820895},{"$f":"MIN(6,MAX(0.5,Beta*G*($Y103-Voff_trim)/(MAX(0,MIN(4.5,W103)-Alpha1_A)+MAX(0,MIN(4.5,W103)-Alpha1_B)-Alpha1_C)+Alpha2))","v":6}]
[null,null,null,null,null,null,269,0.103868861432006,4.58608597735649,3.64098299812991,3.63688441725142,0.000456570969391473,0.521367521367521,2.45957925233729,0.0732522350558588,3.35330262088195,1.7580353665647,0.0677995080076351,0.76038338658147,2.34580398950858,1.56181100976867,1.54877231220712,2.34580398950858,4.64684014869888,-0.124842007434944,6]
[null,null,null,null,null,null,270,0.10310088727135,4.57095232558851,3.6140776240022,3.60997956807982,0.000456570969391473,0.521367521367521,2.45479205967514,0.0732522350558588,3.30436933119307,1.74462592097119,0.0677995080076351,0.76038338658147,2.34214013855303,1.55787837639916,1.54877231220712,2.34214013855303,4.62962962962963,-0.12437962962963,6]
[null,null,null,null,null,null,271,0.102341398974434,4.55593036128744,3.58746954547431,3.58337200870745,0.000456570969391473,0.521367521367521,2.45003433033217,0.0732522350558588,3.2563304261632,1.73136464537345,0.0677995080076351,0.76038338658147,2.33849953257325,1.55397476615414,1.54877231220712,2.33849953257325,4.61254612546125,-0.123920664206642,6]
[null,null,null,null,null,null,272,0.101590271978825,4.54101885260624,3.56115439859878,3.557057375272,0.000456570969391473,0.521367521367521,2.44530577527039,0.0732522350558588,3.20916632335964,1.71824936481138,0.0677995080076351,0.76038338658147,2.33488194295637,1.55009985892563,1.54877231220712,2.33488194295637,4.59558823529412,-0.123465073529412,6]
[null,null,null,null,null,null,273,0.100847383999267,4.52621658574687,3.53512789920732,3.53103138368875,0.000456570969391473,0.521367521367521,2.44060610933624,0.0732522350558588,3.16285793915179,1.70527794408618,0.0677995080076351,0.76038338658147,2.33128714416419,1.54625333929587,1.54877231220712,2.33128714416419,4.57875457875458,-0.123012820512821,6]
[null,null,null,null,null,null,274,0.100112614977908,4.51152236463101,3.50938584116693,3.50528982790678,0.000456570969391473,0.521367521367521,2.43593505119446,0.0732522350558588,3.11738667423737,1.69244828689133,0.0677995080076351,0.76038338658147,2.32771491368077,1.54243489645172,1.54877231220712,2.32771491368077,4.56204379562044,-0.122563868613139,6]
[null,null,null,null,null,null,275,0.0993858470357869,4.49693501057781,3.48392409468048,3.47982857820953,0.000456570969391473,0.521367521367521,2.43129232326322,0.0732522350558588,3.07273439963955,1.67975833496555,0.0677995080076351,0.76038338658147,2.324165031961,1.53864422410099,1.54877231220712,2.324165031961,4.54545454545455,-0.122118181818182,6]
[null,null,null,null,null,null,276,0.0986669644255591,4.48245336198876,3.45873860463019,3.45464357955836,0.000456570969391473,0.521367521367521,2.42667765165063,0.0732522350558588,3.02888344315804,1.6672060672672,0.0677995080076351,0.76038338658147,2.32063728238043,1.53488102039048,1.54877231220712,2.32063728238043,4.52898550724638,-0.121675724637681,6]
[null,null,null,null,null,null,277,0.0979558534854017,4.46807627403934,3.43382538896303,3.42973084997791,0.000456570969391473,0.521367521367521,2.42209076609253,0.0732522350558588,2.98581657625769,1.65478949916959,0.0677995080076351,0.76038338658147,2.31713145118592,1.53114498782589,1.54877231220712,2.31713145118592,4.51263537906137,-0.121236462093863,6]
[null,null,null,null,null,null,278,0.0972524025940866,4.45380261837733,3.40918053711654,3.40508647898204,0.000456570969391473,0.521367521367521,2.41753139989156,0.0732522350558588,2.94351700137918,1.64250668167644,0.0677995080076351,0.76038338658147,2.31364732744745,1.52743583319343,1.54877231220712,2.31364732744745,4.49640287769784,-0.12080035971223,6]
[null,null,null,null,null,null,279,0.0965565021271745,4.43963128282759,3.38480020848424,3.38070662603918,0.000456570969391473,0.521367521367521,2.41299928985746,0.0732522350558588,2.90196833965661,1.630355700657,0.0677995080076351,0.76038338658147,2.31018470301082,1.52375326748305,1.54877231220712,2.31018470301082,4.48028673835125,-0.120367383512545,6]
[null,null,null,null,null,null,{"$f":"G114+1","v":280},0.0958680444143034,4.4255611711032,3.36068063091919,3.35658751907602,0.000456570969391473,0.521367521367521,2.4084941762486,0.0732522350558588,2.86115461902755,1.61833467610028,0.0677995080076351,0.76038338658147,2.30674337245134,1.52009700581347,1.54877231220712,2.30674337245134,4.46428571428571,-0.1199375,6]
[null,null,null,null,null,null,281,0.0951869236975391,4.41159120252276,3.33681809927488,3.33272545301831,0.000456570969391473,0.521367521367521,2.40401580271465,0.0732522350558588,2.82106026272169,1.60644176138781,0.0677995080076351,0.76038338658147,2.30332313302845,1.51646676735862,1.54877231220712,2.30332313302845,4.44839857651246,-0.119510676156584,6]
[null,null,null,null,null,null,282,0.0945130360907574,4.39772031173368,3.31320897398218,3.30911678836796,0.000456570969391473,0.521367521367521,2.39956391624044,0.0732522350558588,2.78167007811483,1.59467514258444,0.0677995080076351,0.76038338658147,2.29992378464127,1.51286227527579,1.54877231220712,2.29992378464127,4.43262411347518,-0.119086879432624,6]
[null,null,null,null,null,null,283,0.0938462795400291,4.38394744844133,3.2898496796615,3.28575794981513,0.000456570969391473,0.521367521367521,2.39513826709093,0.0732522350558588,2.74296924593512,1.58303303774661,0.0677995080076351,0.76038338658147,2.29654512978502,1.50928325663524,1.54877231220712,2.29654512978502,4.41696113074205,-0.118666077738516,6]
[null,null,null,null,null,null,284,0.0931865537849805,4.370271577144,3.26673670376906,3.26264542488456,0.000456570969391473,0.521367521367521,2.39073860875726,0.0732522350558588,2.70494330980954,1.57151369624767,0.0677995080076351,0.76038338658147,2.29318697350831,1.50572944235131,1.54877231220712,2.29318697350831,4.40140845070423,-0.11824823943662,6]
[null,null,null,null,null,null,285,0.0925337603211005,4.35669167687332,3.24386659527634,3.23977576261508,0.000456570969391473,0.521367521367521,2.38636469790394,0.0732522350558588,2.66757816613847,1.56011539811975,0.0677995080076351,0.76038338658147,2.28984912337127,1.50220056711499,1.54877231220712,2.28984912337127,4.3859649122807,-0.117833333333333,6]
[null,null,null,null,null,null,286,0.0918878023629687,4.3432067409402,3.22123596338183,3.21714557227134,0.000456570969391473,0.521367521367521,2.38201629431697,0.0732522350558588,2.63086005428715,1.54883645341169,0.0677995080076351,0.76038338658147,2.28653138940457,1.49869636932788,1.54877231220712,2.28653138940457,4.37062937062937,-0.117421328671329,6]
[null,null,null,null,null,null,{"$f":"G121+1","v":287},0.0912485848083792,4.32981577668605,3.19884147625412,3.19475152208693,0.000456570969391473,0.521367521367521,2.37769316085311,0.0732522350558588,2.59477554708287,1.53767520156259,0.0677995080076351,0.76038338658147,2.28323358406916,1.49521659103753,1.54877231220712,2.28323358406916,4.35540069686411,-0.117012195121951,6]
[null,null,null,null,null,null,288,0.0906160142033346,4.31651780523922,3.1766798598055,3.17259033803803,0.000456570969391473,0.521367521367521,2.3733950633901,0.0732522350558588,2.55931154160752,1.52663001079061,0.0677995080076351,0.76038338658147,2.27995552221688,1.49176097787421,1.54877231220712,2.27995552221688,4.34027777777778,-0.116605902777778,6]
[null,null,null,null,null,null,289,0.0899899987078865,4.30331186127646,3.1547478964952,3.15065880264663,0.000456570969391473,0.521367521367521,2.36912177077778,0.0732522350558588,2.52445525027519,1.51569927749649,0.0677995080076351,0.76038338658147,2.2766970210518,1.48832927898883,1.54877231220712,2.2766970210518,4.32525951557093,-0.116202422145329,6]
[null,null,null,null,null,null,290,0.0893704480627989,4.2901969927893,3.13304242416147,3.12895375381269,0.000456570969391473,0.521367521367521,2.36487305479031,0.0732522350558588,2.49019419218507,1.5048814256815,0.0677995080076351,0.76038338658147,2.27345790009232,1.48492124699232,1.54877231220712,2.27345790009232,4.31034482758621,-0.115801724137931,6]
[null,null,null,null,null,null,291,0.0887572735570127,4.27717226085532,3.11156033488173,3.10747208367428,0.000456570969391473,0.521367521367521,2.36064869007922,0.0732522350558588,2.45651618474032,1.49417490637928,0.0677995080076351,0.76038338658147,2.27023798113404,1.48153663789612,1.54877231220712,2.27023798113404,4.29553264604811,-0.115403780068729,6]
[null,null,null,null,null,null,292,0.0881503879958879,4.26423673941403,3.09029857385996,3.08621073749496,0.000456570969391473,0.521367521367521,2.35644845412737,0.0732522350558588,2.42340933552379,1.48357819710142,0.0677995080076351,0.76038338658147,2.26703708821329,1.47817521105401,1.54877231220712,2.26703708821329,4.28082191780822,-0.115008561643836,6]
[null,null,null,null,null,null,293,0.0875497056702045,4.25138951504743,3.06925413834067,3.06516671257785,0.000456570969391473,0.521367521367521,2.35227212720389,0.0732522350558588,2.39086203442184,1.47308980129608,0.0677995080076351,0.76038338658147,2.26385504757146,1.47483672910502,1.54877231220712,2.26385504757146,4.26621160409556,-0.114616040955631,6]
[null,null,null,null,null,null,294,0.0869551423258988,4.23862968676495,3.04842407654862,3.04433705720528,0.000456570969391473,0.521367521367521,2.34811949231986,0.0732522350558588,2.35886294598797,1.46270824781966,0.0677995080076351,0.76038338658147,2.2606916876199,1.47152095791759,1.54877231220712,2.2606916876199,4.25170068027211,-0.11422619047619,6]
[null,null,null,null,null,null,295,0.0863666151345175,4.22595636579287,3.02780548665373,3.02371886960381,0.000456570969391473,0.521367521367521,2.34399033518496,0.0732522350558588,2.32740100203807,1.45243209042084,0.0677995080076351,0.76038338658147,2.25754683890559,1.46822766653482,1.54877231220712,2.25754683890559,4.23728813559322,-0.113838983050847,6]
[null,null,null,null,null,null,296,0.0857840426643694,4.21336867536789,3.00739551576038,3.00330929693347,0.000456570969391473,0.521367521367521,2.33988444416489,0.0732522350558588,2.29646539446957,1.4422599072369,0.0677995080076351,0.76038338658147,2.25442033407744,1.46495662712085,1.54877231220712,2.25442033407744,4.22297297297297,-0.113454391891892,6]
[null,null,null,null,null,null,297,0.0852073448523551,4.200865750535,2.9871913589205,2.98310553430091,0.000456570969391473,0.521367521367521,2.33580161023959,0.0732522350558588,2.26604556829695,1.43219030030183,0.0677995080076351,0.76038338658147,2.25131200785323,1.46170761490832,1.54877231220712,2.25131200785323,4.20875420875421,-0.113072390572391,6]
[null,null,null,null,null,null,{"$f":"G132+1","v":298},0.0846364429764581,4.18844673794932,2.96719025816981,2.96310482379568,0.000456570969391473,0.521367521367521,2.3317416269623,0.0732522350558588,2.23613121489648,1.42222189506599,0.0677995080076351,0.76038338658147,2.24822169698713,1.45848040814689,1.54877231220712,2.24822169698713,4.19463087248322,-0.112692953020134,6]
[null,null,null,null,null,null,299,0.0840712596288787,4.17611079568193,2.94738950158656,2.94330445354894,0.000456570969391473,0.521367521367521,2.32770429041936,0.0732522350558588,2.20671226545305,1.41235333992704,0.0677995080076351,0.76038338658147,2.24514924023794,1.45527478805275,1.54877231220712,2.24514924023794,4.18060200668896,-0.112316053511706,6]
[null,null,null,null,null,null,300,{"$f":"(Iout*(Vout_nom^2)*2.5*Rsense*K_1)/(eff*(G135^2)*K_FQ)*us","v":0.0835117186897932},{"$f":"(1*10^-9*(5*10^8*SQRT(fsw*kHz)+(1.09655978*10^10)*SQRT(ftyp)*SQRT(H135)))/SQRT(fsw*kHz)","v":4.16385709302966},{"$f":"(b_1^3/(27*a_1^3))-(d_1^3/27)+SQRT((ftyp)^2*H135^2/(4*a_1^2*c_1^2*(fsw*kHz)^2))+(b_1^3*(ftyp)*H135/(27*a_1^4*c_1*(fsw*kHz))-(d_1^3*(ftyp)*H135/(27*a_1*c_1*(fsw*kHz)))+(b_1*d_1^2*(ftyp)*H135/(9*a_1^2*c_1*(fsw*kHz)))-(b_1^2*d_1*(ftyp)*H135/(9*a_1^3*c_1*(fsw*kHz))))","v":2.92778642237228},{"$f":"(b_1*d_1^2/(9*a_1))-(b_1^2*d_1/(9*a_1^2))+(ftyp*H135/(2*a_1*c_1*fsw*kHz))","v":2.92370175681425},{"$f":"(d_1^2/9)+(b_1^2/(9*a_1^2))-(2*b_1*d_1/(9*a_1))","v":0.000456570969391473},{"$f":"((b_1*c_1*fsw*kHz)+(2*a_1*c_1*d_1*fsw*kHz))/(3*a_1*c_1*fsw*kHz)","v":0.521367521367521},2.32368939919082,{"$f":"(b_2^3/(27*a_2^3))-(d_2^3/27)","v":0.0732522350558588},{"$f":"(ftyp^2*H135^2/(4*a_2^2*c_2^2*(fsw*kHz)^2))+(b_2^3*ftyp*H135/(27*a_2^4*c_2*(fsw*kHz)))-(d_2^3*ftyp*H135/(27*a_2*c_2*(fsw*kHz)))+(b_2*d_2^2*ftyp*H135/(9*a_2^2*c_2*(fsw*kHz)))-(b_2^2*d_2*ftyp*H135/(9*a_2^3*c_2*(fsw*kHz)))","v":2.17777888460264},{"$f":"(b_2*d_2^2/(9*a_2))-(b_2^2*d_2/(9*a_2^2))+(ftyp*H135/(2*a_2*c_2*(fsw*kHz)))","v":1.40258330577173},{"$f":"(d_2^2/9)+(b_2^2/(9*a_2^2))-(2*b_2*d_2/(9*a_2))","v":0.0677995080076351},{"$f":"(b_2*c_2*(fsw*kHz)+2*a_2*c_2*d_2*(fsw*kHz))/(3*a_2*c_2*(fsw*kHz))","v":0.76038338658147},2.24209447833786,{"$f":"c_3+(SQRT(ftyp)*SQRT(H135)/(SQRT(a_3)*SQRT(b_3)*SQRT(fsw*kHz)))","v":1.45209053875924},{"$f":"(a_4*(fsw*kHz)*b_4/ftyp)","v":1.54877231220712},2.24209447833786,{"$f":"Pin_max/G135","v":4.16666666666667},{"$f":"-X135*Rsense*1.414","v":-0.111941666666667},{"$f":"MIN(6,MAX(0.5,Beta*G*($Y135-Voff_trim)/(MAX(0,MIN(4.5,W135)-Alpha1_A)+MAX(0,MIN(4.5,W135)-Alpha1_B)-Alpha1_C)+Alpha2))","v":6}]
[null,null,null,null,null,null,301,0.0829577453017228,4.15168481032856,2.90837839795374,2.90429411106953,0.000456570969391473,0.521367521367521,{"$f":"(J136+K136)^(1/3)+(L136/(J136^(1/3)))+M136","v":2.3196967543117},0.0732522350558588,2.14932146426369,1.39291048552836,0.0677995080076351,0.76038338658147,{"$f":"((O136+SQRT(P136)+Q136)^(1/3))+(R136/((O136+SQRT(P136)+Q136)^(1/3)))+S136","v":2.23905725396184},1.44892744726835,1.54877231220712,{"$f":"IF(I136>=0.5,IF(I136<1,I136,IF(N136>=1,IF(N136<2,N136,IF(T136>=2,IF(T136<4.5,T136,IF(U136>=4.5,IF(U136<4.6,U136,V136))))))))","v":2.23905725396184},4.15282392026578,-0.11156976744186,6]
[null,null,null,null,null,null,302,0.0824092658444957,4.13959313877118,2.88916284910579,2.88507893713998,0.000456570969391473,0.521367521367521,2.31572615923408,0.0732522350558588,2.12133061765141,1.3833335937296,0.0677995080076351,0.76038338658147,2.23603741169756,1.44578530340322,1.54877231220712,2.23603741169756,4.13907284768212,-0.111200331125828,6]
[null,null,null,null,null,null,303,0.0818662079107864,4.12758128022738,2.8701372390944,2.86605369834106,0.000456570969391473,0.521367521367521,2.31177741978982,0.0732522350558588,2.09379717346881,1.37385136608541,0.0677995080076351,0.76038338658147,2.23303479801589,1.44266389976162,1.54877231220712,2.23303479801589,4.12541254125413,-0.110833333333333,6]
[null,null,null,null,null,null,304,0.0813285002822172,4.11564844706874,2.85129907283941,2.84721589964129,0.000456570969391473,0.521367521367521,2.30785034415404,0.0732522350558588,2.06671217026883,1.36446255906572,0.0677995080076351,0.76038338658147,2.23004926124202,1.4395630316703,1.54877231220712,2.23004926124202,4.11184210526316,-0.11046875,6]
[null,null,null,null,null,null,305,0.0807960729060079,4.10379386199638,2.83264589609646,2.82856308684418,0.000456570969391473,0.521367521367521,2.30394474280922,0.0732522350558588,2.04006685098183,1.35516594949272,0.0677995080076351,0.76038338658147,2.22708065152701,1.43648249714024,1.54877231220712,2.22708065152701,4.0983606557377,-0.110106557377049,6]
[null,null,null,null,null,null,306,0.080268856872158,4.09201675787221,2.81417529465755,2.81009284578886,0.000456570969391473,0.521367521367521,2.30006042851,0.0732522350558588,2.01385265760328,1.34596033414246,0.0677995080076351,0.76038338658147,2.22412882081991,1.43342209682278,1.54877231220712,2.22412882081991,4.08496732026144,-0.109746732026144,6]
[null,null,null,null,null,null,307,0.0797467843911488,4.08031637755341,2.79588489356993,2.79180280156889,0.000456570969391473,0.521367521367521,2.29619721624863,0.0732522350558588,1.98806122603621,1.33684452935552,0.0677995080076351,0.76038338658147,2.22119362284043,1.43038163396668,1.54877231220712,2.22119362284043,4.07166123778502,-0.109389250814332,6]
[null,null,null,null,null,null,308,0.0792297887721516,4.06869197373018,2.77777235637256,2.77369061776884,0.000456570969391473,0.521367521367521,2.29235492322105,0.0732522350558588,1.96268438108362,1.32781737065645,0.0677995080076351,0.76038338658147,2.21827491305208,1.42736091437588,1.54877231220712,2.21827491305208,4.05844155844156,-0.109034090909091,6]
[null,null,null,null,null,null,309,0.078717804401728,4.05714280876666,2.75983538434994,2.75575399571806,0.000456570969391473,0.521367521367521,2.28853336879356,0.0732522350558588,1.93771413158594,1.31887771238194,0.0677995080076351,0.76038338658147,2.21537254863577,1.4243597463682,1.54877231220712,2.21537254863577,4.0453074433657,-0.108681229773463,6]
[null,null,null,null,null,null,310,0.0782107667230113,4.04566815454483,2.74207171580273,2.73799067376133,0.000456570969391473,0.521367521367521,2.28473237447019,0.0732522350558588,1.91314266569884,1.31002442731724,0.0677995080076351,0.76038338658147,2.21248638846399,1.42137794073475,1.54877231220712,2.21248638846399,4.03225806451613,-0.10833064516129,6]
[null,null,null,null,null,null,{"$f":"G145+1","v":311},0.0777086122153554,4.03426729231156,2.72447912533478,2.72039842654591,0.000456570969391473,0.521367521367521,2.28095176386054,0.0732522350558588,1.88896234630705,1.30125640634086,0.0677995080076351,0.76038338658147,2.20961629307532,1.41841531070023,1.54877231220712,2.20961629307532,4.01929260450161,-0.10798231511254,6]
[null,null,null,null,null,null,312,0.077211278374439,4.02293951252851,2.70705542315606,2.70297506432451,0.000456570969391473,0.521367521367521,2.27719136264831,0.0732522350558588,1.86516570656965,1.29257255807717,0.0677995080076351,0.76038338658147,2.20676212464957,1.41547167188389,1.54877231220712,2.20676212464957,4.00641025641026,-0.107636217948718,6]
[null,null,null,null,null,null,313,0.0767187036928149,4.01168411472491,2.68979845440127,2.68571843227388,0.000456570969391473,0.521367521367521,2.27345099856034,0.0732522350558588,1.84174544559287,1.28397180855672,0.0677995080076351,0.76038338658147,2.20392374698323,1.41254684226125,1.54877231220712,2.20392374698323,3.99361022364217,-0.107292332268371,6]
[null,null,null,null,null,null,314,0.076230827640892,4.00050040735317,2.67270609846351,2.66862640982848,0.000456570969391473,0.521367521367521,2.26973050133624,0.0732522350558588,1.81869442422612,1.27545310088426,0.0677995080076351,0.76038338658147,2.20110102546543,1.40964064212666,1.54877231220712,2.20110102546543,3.98089171974522,-0.106950636942675,6]
[null,null,null,null,null,null,315,0.0757475906483385,3.98938770764729,2.65577626834281,2.65169691002907,0.000456570969391473,0.521367521367521,2.26602970269857,0.0732522350558588,1.79600566097765,1.26701539491394,0.0677995080076351,0.76038338658147,2.19829382705432,1.40675289405642,1.54877231220712,2.19829382705432,3.96825396825397,-0.106611111111111,6]
[null,null,null,null,null,null,316,0.0752689340858976,3.97834534148385,2.639006910009,2.63492787888555,0.000456570969391473,0.521367521367521,2.26234843632349,0.0732522350558588,1.77367232804573,1.25865766693187,0.0677995080076351,0.76038338658147,2.19550202025387,1.4038834228727,1.54877231220712,2.19550202025387,3.95569620253165,-0.106273734177215,6]
[null,null,null,null,null,null,317,0.0747948002476031,3.96737264324573,2.62239600177868,2.61831729475396,0.000456570969391473,0.521367521367521,2.25868653781205,0.0732522350558588,1.75168774746208,1.25037890934552,0.0677995080076351,0.76038338658147,2.19272547509112,1.40103205560811,1.54877231220712,2.19272547509112,3.94321766561514,-0.105938485804416,6]
[null,null,null,null,null,null,318,0.0743251323333866,3.95646895568835,2.60594155370587,2.60186316772717,0.000456570969391473,0.521367521367521,2.25504384466187,0.0732522350558588,1.73004538734373,1.24217813038009,0.0677995080076351,0.76038338658147,2.18996406309374,1.39819862147098,1.54877231220712,2.18996406309374,3.93081761006289,-0.10560534591195,6]
[null,null,null,null,null,null,319,0.0738598744320652,3.94563362980845,2.58964160698601,2.58556353903882,0.000456570969391473,0.521367521367521,2.25142019623942,0.0732522350558588,1.70873885825015,1.23405435378142,0.0677995080076351,0.76038338658147,2.18721765726812,1.3953829518112,1.54877231220712,2.18721765726812,3.91849529780564,-0.105274294670846,6]
[null,null,null,null,null,null,{"$f":"G154+1","v":320},0.0733989715047011,3.9348660247153,2.57349423337296,2.56941648048039,0.000456570969391473,0.521367521367521,2.24781543375273,0.0732522350558588,1.68776190964223,1.22600661852546,0.0677995080076351,0.76038338658147,2.18448613207777,1.39258488008679,1.54877231220712,2.18448613207777,3.90625,-0.1049453125,6]
[null,null,null,null,null,null,321,0.0729423693683232,3.92416550750435,2.55749753460869,2.5534200938309,0.000456570969391473,0.521367521367521,2.2442294002246,0.0732522350558588,1.66710842644008,1.21803397853402,0.0677995080076351,0.76038338658147,2.18176936342207,1.38980424183107,1.54877231220712,2.18176936342207,3.89408099688474,-0.104618380062305,6]
[null,null,null,null,null,null,322,0.0724900146800026,3.91353145313322,2.54164964186542,2.53757251029902,0.000456570969391473,0.521367521367521,2.24066194046632,0.0732522350558588,1.64677242567645,1.21013550239673,0.0677995080076351,0.76038338658147,2.17906722861548,1.38704087462041,1.54877231220712,2.17906722861548,3.88198757763975,-0.10429347826087,6]
[null,null,null,null,null,null,323,0.072041854921272,3.90296324429999,2.5259487151997,2.52187188997721,0.000456570969391473,0.521367521367521,2.23711290105177,0.0732522350558588,1.62674805324298,1.20231027309896,0.0677995080076351,0.76038338658147,2.17637960636707,1.38429461804264,1.54877231220712,2.17637960636707,3.86996904024768,-0.103970588235294,6]
[null,null,null,null,null,null,324,0.0715978383828817,3.89246027132376,2.51039294301842,2.5063164213077,0.000456570969391473,0.521367521367521,2.23358213029205,0.0732522350558588,1.60702958072633,1.19455738775568,0.0677995080076351,0.76038338658147,2.1737063767604,1.38156531366596,1.54877231220712,2.1737063767604,3.85802469135802,-0.103649691358025,6]
[null,null,null,null,null,null,325,0.071157914149883,3.88202193202737,2.49498054155616,2.49090432055987,0.000456570969391473,0.521367521367521,2.23006947821052,0.0732522350558588,1.5876114023314,1.18687595735102,0.0677995080076351,0.76038338658147,2.17104742123376,1.37885280500853,1.54877231220712,2.17104742123376,3.84615384615385,-0.103330769230769,6]
[null,null,null,null,null,null,326,0.0707220320870318,3.87164763162238,2.47970975436386,2.47563383131894,0.000456570969391473,0.521367521367521,2.22657479651827,0.0732522350558588,1.56848803188919,1.17926510648333,0.0677995080076351,0.76038338658147,2.16840262256078,1.3761569375085,1.54877231220712,2.16840262256078,3.83435582822086,-0.103013803680982,6]
[null,null,null,null,null,null,327,0.070290142824504,3.86133678259601,2.46457885180833,2.46050322398547,0.000456570969391473,0.521367521367521,2.22309793859,0.0732522350558588,1.5496540999464,1.17172397311585,0.0677995080076351,0.76038338658147,2.16577186483131,1.37347755849472,1.54877231220712,2.16577186483131,3.82262996941896,-0.10269877675841,6]
[null,null,null,null,null,null,328,0.0698621977439153,3.85108880460029,2.44958613058252,2.44551079528562,0.000456570969391473,0.521367521367521,2.21963875944039,0.0732522350558588,1.53110435093463,1.16425170833254,0.0677995080076351,0.76038338658147,2.16315503343272,1.37081451715784,1.54877231220712,2.16315503343272,3.8109756097561,-0.102385670731707,6]
[null,null,null,null,null,null,329,0.069438148964638,3.84090312434315,2.43472991322606,2.43065486779178,0.000456570969391473,0.521367521367521,2.21619711570079,0.0732522350558588,1.51283364041652,1.15684747609919,0.0677995080076351,0.76038338658147,2.16055201503145,1.3681676645221,1.54877231220712,2.16055201503145,3.79939209726444,-0.102074468085106,6]
[null,null,null,null,null,null,330,0.0690179493304076,3.8307791754815,2.42000854765611,2.41593378945333,0.000456570969391473,0.521367521367521,2.21277286559633,0.0732522350558588,1.49483693240663,1.14951045302955,0.0677995080076351,0.76038338658147,2.15796269755491,1.36553685341749,1.54877231220712,2.15796269755491,3.78787878787879,-0.101765151515152,6]
[null,null,null,null,null,null,331,0.068601552396212,3.8207163985163,2.40542040670799,2.40134593313734,0.000456570969391473,0.521367521367521,2.2093658689235,0.0732522350558588,1.47710929676478,1.1422398281564,0.0677995080076351,0.76038338658147,2.15538697017368,1.36292193845248,1.54877231220712,2.15538697017368,3.77643504531722,-0.101457703927492,6]
[null,null,null,null,null,null,332,{"$f":"(Iout*(Vout_nom^2)*2.5*Rsense*K_1)/(eff*(G167^2)*K_FQ)*us","v":0.0681889124154575},{"$f":"(1*10^-9*(5*10^8*SQRT(fsw*kHz)+(1.09655978*10^10)*SQRT(ftyp)*SQRT(H167)))/SQRT(fsw*kHz)","v":3.81071424068945},{"$f":"(b_1^3/(27*a_1^3))-(d_1^3/27)+SQRT((ftyp)^2*H167^2/(4*a_1^2*c_1^2*(fsw*kHz)^2))+(b_1^3*(ftyp)*H167/(27*a_1^4*c_1*(fsw*kHz))-(d_1^3*(ftyp)*H167/(27*a_1*c_1*(fsw*kHz)))+(b_1*d_1^2*(ftyp)*H167/(9*a_1^2*c_1*(fsw*kHz)))-(b_1^2*d_1*(ftyp)*H167/(9*a_1^3*c_1*(fsw*kHz))))","v":2.39096388768558},{"$f":"(b_1*d_1^2/(9*a_1))-(b_1^2*d_1/(9*a_1^2))+(ftyp*H167/(2*a_1*c_1*fsw*kHz))","v":2.38688969617895},{"$f":"(d_1^2/9)+(b_1^2/(9*a_1^2))-(2*b_1*d_1/(9*a_1))","v":0.000456570969391473},{"$f":"((b_1*c_1*fsw*kHz)+(2*a_1*c_1*d_1*fsw*kHz))/(3*a_1*c_1*fsw*kHz)","v":0.521367521367521},2.20597598702797,{"$f":"(b_2^3/(27*a_2^3))-(d_2^3/27)","v":0.0732522350558588},{"$f":"(ftyp^2*H167^2/(4*a_2^2*c_2^2*(fsw*kHz)^2))+(b_2^3*ftyp*H167/(27*a_2^4*c_2*(fsw*kHz)))-(d_2^3*ftyp*H167/(27*a_2*c_2*(fsw*kHz)))+(b_2*d_2^2*ftyp*H167/(9*a_2^2*c_2*(fsw*kHz)))-(b_2^2*d_2*ftyp*H167/(9*a_2^3*c_2*(fsw*kHz)))","v":1.45964590665971},{"$f":"(b_2*d_2^2/(9*a_2))-(b_2^2*d_2/(9*a_2^2))+(ftyp*H167/(2*a_2*c_2*(fsw*kHz)))","v":1.13503480270749},{"$f":"(d_2^2/9)+(b_2^2/(9*a_2^2))-(2*b_2*d_2/(9*a_2))","v":0.0677995080076351},{"$f":"(b_2*c_2*(fsw*kHz)+2*a_2*c_2*d_2*(fsw*kHz))/(3*a_2*c_2*(fsw*kHz))","v":0.76038338658147},2.15282472328402,{"$f":"c_3+(SQRT(ftyp)*SQRT(H167)/(SQRT(a_3)*SQRT(b_3)*SQRT(fsw*kHz)))","v":1.36032277598727},{"$f":"(a_4*(fsw*kHz)*b_4/ftyp)","v":1.54877231220712},2.15282472328402,{"$f":"Pin_max/G167","v":3.76506024096386},{"$f":"-X167*Rsense*1.414","v":-0.101152108433735},{"$f":"MIN(6,MAX(0.5,Beta*G*($Y167-Voff_trim)/(MAX(0,MIN(4.5,W167)-Alpha1_A)+MAX(0,MIN(4.5,W167)-Alpha1_B)-Alpha1_C)+Alpha2))","v":6}]
[null,null,null,null,null,null,333,0.067779984327403,3.80077215588257,2.37663741192104,2.37256349994113,0.000456570969391473,0.521367521367521,2.20260308278296,0.0732522350558588,1.44244203610089,1.12789458988609,0.0677995080076351,0.76038338658147,2.15027584849067,1.35773922410742,1.54877231220712,2.15027584849067,3.75375375375375,-0.100848348348348,6]
[null,null,null,null,null,null,334,0.0673747237448581,3.79088960451765,2.36243942434387,2.35836578938372,0.000456570969391473,0.521367521367521,2.19924702056779,0.0732522350558588,1.42549305753655,1.1208184146562,0.0677995080076351,0.76038338658147,2.14774023858996,1.35517114259812,1.54877231220712,2.14774023858996,3.74251497005988,-0.100546407185629,6]
[null,null,null,null,null,null,335,0.0669730869421376,3.78106605345939,2.34836839305889,2.34429503264144,0.000456570969391473,0.521367521367521,2.19590766624698,0.0732522350558588,1.40879443951584,1.11380551353225,0.0677995080076351,0.76038338658147,2.14521778755317,1.35261839291872,1.54877231220712,2.14521778755317,3.73134328358209,-0.100246268656716,6]
[null,null,null,null,null,null,{"$f":"G170+1","v":336},0.0665750308432663,3.77130097591933,2.33442280893299,2.33034972061061,0.000456570969391473,0.521367521367521,2.19258488714953,0.0732522350558588,1.39234174441334,1.10685513437311,0.0677995080076351,0.76038338658147,2.14270839051022,1.35008083817789,1.54877231220712,2.14270839051022,3.7202380952381,-0.0999479166666668,6]
[null,null,null,null,null,null,337,0.0661805130104288,3.76159385136171,2.3206011851905,2.31652836654457,0.000456570969391473,0.521367521367521,2.18927855204869,0.0732522350558588,1.37613062621403,1.09996653618045,0.0677995080076351,0.76038338658147,2.14021194373359,1.34755834310912,1.54877231220712,2.14021194373359,3.70919881305638,-0.0996513353115727,6]
[null,null,null,null,null,null,338,0.0657894916326581,3.75194416541094,2.30690205701689,2.30282950565738,0.000456570969391473,0.521367521367521,2.18598853114199,0.0732522350558588,1.36015682835686,1.09313898890121,0.0677995080076351,0.76038338658147,2.13772834462254,1.34505077404666,1.54877231220712,2.13772834462254,3.69822485207101,-0.0993565088757398,6]
[null,null,null,null,null,null,339,0.065401925514757,3.74235140976076,2.29332398117064,2.28925169473567,0.000456570969391473,0.521367521367521,2.18271469603163,0.0732522350558588,1.3444161816354,1.08637177323416,0.0677995080076351,0.76038338658147,2.13525749168757,1.34255799890198,1.54877231220712,2.13525749168757,3.68731563421829,-0.0990634218289086,6]
[null,null,null,null,null,null,340,0.065017774066448,3.73281508208499,2.27986553560312,2.27579351175856,0.000456570969391473,0.521367521367521,2.17945691970515,0.0732522350558588,1.32890460215367,1.07966418044046,0.0677995080076351,0.76038338658147,2.13279928453516,1.34007988714051,1.54877231220712,2.13279928453516,3.67647058823529,-0.0987720588235293,6]
[null,null,null,null,null,null,341,0.0646369972917449,3.72333468594984,2.26652531908623,2.2624535555253,0.000456570969391473,0.521367521367521,2.17621507651653,0.0732522350558588,1.31361808933567,1.07301551215807,0.0677995080076351,0.76038338658147,2.13035362385276,1.33761630975886,1.54877231220712,2.13035362385276,3.66568914956012,-0.0984824046920822,6]
[null,null,null,null,null,null,342,0.064259555778542,3.71390973072777,2.25330195084768,2.24923044529052,0.000456570969391473,0.521367521367521,2.17298904216748,0.0732522350558588,1.29855272398709,1.06642508021997,0.0677995080076351,0.76038338658147,2.12792041139401,1.33516713926249,1.54877231220712,2.12792041139401,3.65497076023392,-0.0981944444444445,6]
[null,null,null,null,null,null,343,0.0638854106884154,3.70453973151282,2.24019407021365,2.23612282040696,0.000456570969391473,0.521367521367521,2.16977869368912,0.0732522350558588,1.28370466640752,1.05989220647608,0.0677995080076351,0.76038338658147,2.12549954996423,1.33273224964365,1.54877231220712,2.12549954996423,3.64431486880466,-0.097908163265306,6]
[null,null,null,null,null,null,344,0.0635145237466315,3.69522420903749,2.22720033625878,2.22312933997542,0.000456570969391473,0.521367521367521,2.16658390942394,0.0732522350558588,1.26907015455185,1.05341622261883,0.0677995080076351,0.76038338658147,2.12309094340613,1.3303115163598,1.54877231220712,2.12309094340613,3.63372093023256,-0.097623546511628,6]
[null,null,null,null,null,null,345,0.0631468572323578,3.685962689591,2.21431942746322,2.21024868250184,0.000456570969391473,0.521367521367521,2.16340456900804,0.0732522350558588,1.25464550223942,1.04699647001219,0.0677995080076351,0.76038338658147,2.12069449658578,1.32790481631238,1.54877231220712,2.12069449658578,3.6231884057971,-0.0973405797101449,6]
[null,null,null,null,null,null,{"$f":"G180+1","v":346},0.0627823739690717,3.67675470493901,2.20155004137656,2.19747954556121,0.000456570969391473,0.521367521367521,2.16024055335366,0.0732522350558588,1.24042709740944,1.04063229952421,0.0677995080076351,0.76038338658147,2.11831011537876,1.32551202782593,1.54877231220712,2.11831011537876,3.61271676300578,-0.0970592485549133,6]
[null,null,null,null,null,null,347,0.0624210373151624,3.66759979224466,2.18889089428862,2.18482064546841,0.000456570969391473,0.521367521367521,2.15709174463207,0.0732522350558588,1.22641140042148,1.03432307136294,0.0677995080076351,0.76038338658147,2.1159377066566,1.32313303062759,1.54877231220712,2.1159377066566,3.60230547550432,-0.096779538904899,6]
[null,null,null,null,null,null,348,0.0620628111547215,3.65849749399108,2.1763407209068,2.17227071695552,0.000456570969391473,0.521367521367521,2.15395802625658,0.0732522350558588,1.21259494239972,1.02806815491562,0.0677995080076351,0.76038338658147,2.11357717827341,1.32076770582693,1.54877231220712,2.11357717827341,3.59195402298851,-0.0965014367816093,6]
[null,null,null,null,null,null,349,0.0617076598885181,3.64944735790515,2.16389827403988,2.15982851285566,0.000456570969391473,0.521367521367521,2.15083928286603,0.0732522350558588,1.19897432361958,1.02186692859109,0.0677995080076351,0.76038338658147,2.11122843905268,1.3184159358962,1.54877231220712,2.11122843905268,3.58166189111748,-0.0962249283667622,6]
[null,null,null,null,null,null,350,0.0613555484251542,3.64044893688256,2.15156232428818,2.14749280379313,0.000456570969391473,0.521367521367521,2.14773540030837,0.0732522350558588,1.18554621193574,1.01571877966536,0.0677995080076351,0.76038338658147,2.10889139877441,1.31607760465078,1.54877231220712,2.10889139877441,3.57142857142857,-0.09595,6]
[null,null,null,null,null,null,351,0.0610064421723962,3.63150178891424,2.13933165973984,2.13526237787973,0.000456570969391473,0.521367521367521,2.1446462656246,0.0732522350558588,1.1723073412502,1.00962310413025,0.0677995080076351,0.76038338658147,2.10656596816234,1.31375259723012,1.54877231220712,2.10656596816234,3.56125356125356,-0.0956766381766381,6]
[null,null,null,null,null,null,352,0.0606603070286786,3.62260547701391,2.12720508567319,2.12313604041709,0.000456570969391473,0.521367521367521,2.14157176703294,0.0732522350558588,1.15925451001933,1.00357930654503,0.0677995080076351,0.76038338658147,2.10425205887143,1.3114408000789,1.54877231220712,2.10425205887143,3.55113636363636,-0.0954048295454544,6]
[]
[null,null,null,null,null,null,"VCOMP as a function of Load at Given line voltage"]
[null,null,null,null,null,null,"%Full Load","M1M2","VCOMP1","K1V2","K2V2","K3V2","K4V2","VCOMP2","K1V3","K2V3","K3V3","K4V3","K5V3","VCOMP3","VCOMP4","VCOMP5","VCOMP","IAC RMS","ISENSE_Pk","ICOMP"]
[null,null,null,null,null,null,1,{"$f":"(((G191/100)*Iout)*(Vout_nom^2)*2.5*Rsense*K_1)/(eff*(Vline^2)*K_FQ)*us","v":0.00155290385993417},{"$f":"(1*10^-9*(5*10^8*SQRT(fsw*kHz)+(1.09655978*10^10)*SQRT(ftyp)*SQRT(H191)))/SQRT(fsw*kHz)","v":0.999616876322226},{"$f":"(b_1^3/(27*a_1^3))-(d_1^3/27)+SQRT((ftyp)^2*H191^2/(4*a_1^2*c_1^2*(fsw*kHz)^2))+(b_1^3*(ftyp)*H191/(27*a_1^4*c_1*(fsw*kHz))-(d_1^3*(ftyp)*H191/(27*a_1*c_1*(fsw*kHz)))+(b_1*d_1^2*(ftyp)*H191/(9*a_1^2*c_1*(fsw*kHz)))-(b_1^2*d_1*(ftyp)*H191/(9*a_1^3*c_1*(fsw*kHz))))","v":0.0564234403462857},{"$f":"(b_1*d_1^2/(9*a_1))-(b_1^2*d_1/(9*a_1^2))+(ftyp*H191/(2*a_1*c_1*fsw*kHz))","v":0.0523947985233471},{"$f":"(d_1^2/9)+(b_1^2/(9*a_1^2))-(2*b_1*d_1/(9*a_1))","v":0.000456570969391473},{"$f":"((b_1*c_1*fsw*kHz)+(2*a_1*c_1*d_1*fsw*kHz))/(3*a_1*c_1*fsw*kHz)","v":0.521367521367521},{"$f":"(J191+K191)^(1/3)+(L191/(J191^(1/3)))+M191","v":0.999977860578113},{"$f":"(b_2^3/(27*a_2^3))-(d_2^3/27)","v":0.0732522350558588},{"$f":"(ftyp^2*H191^2/(4*a_2^2*c_2^2*(fsw*kHz)^2))+(b_2^3*ftyp*H191/(27*a_2^4*c_2*(fsw*kHz)))-(d_2^3*ftyp*H191/(27*a_2*c_2*(fsw*kHz)))+(b_2*d_2^2*ftyp*H191/(9*a_2^2*c_2*(fsw*kHz)))-(b_2^2*d_2*ftyp*H191/(9*a_2^3*c_2*(fsw*kHz)))","v":0.00169258774079339},{"$f":"(b_2*d_2^2/(9*a_2))-(b_2^2*d_2/(9*a_2^2))+(ftyp*H191/(2*a_2*c_2*(fsw*kHz)))","v":-0.0284834210441824},{"$f":"(d_2^2/9)+(b_2^2/(9*a_2^2))-(2*b_2*d_2/(9*a_2))","v":0.0677995080076351},{"$f":"(b_2*c_2*(fsw*kHz)+2*a_2*c_2*d_2*(fsw*kHz))/(3*a_2*c_2*(fsw*kHz))","v":0.76038338658147},{"$f":"((O191+SQRT(P191)+Q191)^(1/3))+(R191/((O191+SQRT(P191)+Q191)^(1/3)))+S191","v":1.35528423080591},{"$f":"c_3+(SQRT(ftyp)*SQRT(H191)/(SQRT(a_3)*SQRT(b_3)*SQRT(fsw*kHz)))","v":0.629830528012624},{"$f":"(a_4*(fsw*kHz)*b_4/ftyp)","v":1.54877231220712},{"$f":"IF(I191>=0.5,IF(I191<1,I191,IF(N191>=1,IF(N191<2,N191,IF(VCOMP3>=2,IF(T191<4.5,T191,IF(U191>=4.5,IF(U191<4.6,U191,V191))))))))","v":0.999616876322226},{"$f":"Pin_max*G191/(Vline*100)","v":0.0568181818181818},{"$f":"-Rsense*X191*1.414","v":-0.00152647727272727},{"$f":"MIN(6,MAX(0.5,Beta*G*($Y191-Voff_trim)/(MAX(0,MIN(4.5,W191)-Alpha1_A)+MAX(0,MIN(4.5,W191)-Alpha1_B)-Alpha1_C)+Alpha2))","v":0.5}]
[null,null,null,null,null,null,2,0.00310580771986834,1.20656496248537,0.110828212637305,0.106798509312017,0.000456570969391473,0.521367521367521,{"$f":"(J192+K192)^(1/3)+(L192/(J192^(1/3)))+M192","v":1.12382049322066},0.0732522350558588,0.00485561634677962,-0.00136847253609148,0.0677995080076351,0.76038338658147,{"$f":"((O192+SQRT(P192)+Q192)^(1/3))+(R192/((O192+SQRT(P192)+Q192)^(1/3)))+S192","v":1.41165058931971},0.683608093525513,1.54877231220712,1.12382049322066,0.113636363636364,-0.00305295454545455,0.5]
[null,null,null,null,null,null,3,0.00465871157980251,1.36536181410895,0.165232984928324,0.161202220100686,0.000456570969391473,0.521367521367521,1.21074456016929,0.0732522350558588,0.00948908581795871,0.0257464759719995,0.0677995080076351,0.76038338658147,1.45830485214135,0.724873070891359,1.54877231220712,1.21074456016929,0.170454545454545,-0.00457943181818181,0.5]
[null,null,null,null,null,null,4,0.00621161543973668,1.49923375264445,0.219637757219342,0.215605930889356,0.000456570969391473,0.521367521367521,1.27996419544138,0.0732522350558588,0.0155929961543306,0.0528614244800904,0.0677995080076351,0.76038338658147,1.49865461051308,0.759661056025247,1.54877231220712,1.27996419544138,0.227272727272727,-0.00610590909090908,0.55751048787]
[null,null,null,null,null,null,5,0.00776451929967085,1.6171772981626,0.274042529510361,0.270009641678026,0.000456570969391473,0.521367521367521,1.33842755127321,0.0732522350558588,0.0231673473558954,0.0799763729881813,0.0677995080076351,0.76038338658147,1.5345106348754,0.790309886190917,1.54877231220712,1.33842755127321,0.284090909090909,-0.00763238636363636,0.773292836958045]
[null,null,null,null,null,null,6,0.00931742315960502,1.72380641387266,0.32844730180138,0.324413352466695,0.000456570969391473,0.521367521367521,1.38953728017479,0.0732522350558588,0.032212139422653,0.107091321496272,0.0677995080076351,0.76038338658147,1.56696710348921,0.818018546667046,1.54877231220712,1.38953728017479,0.340909090909091,-0.00915886363636364,0.962916457082473]
[null,null,null,null,null,null,7,0.0108703270195392,1.82186200555952,0.382852074092399,0.378817063255365,0.000456570969391473,0.521367521367521,1.43524441878368,0.0732522350558588,0.0427273723546035,0.134206270004363,0.0677995080076351,0.76038338658147,1.59674297019528,0.843499289705607,1.54877231220712,1.43524441878368,0.397727272727273,-0.0106853409090909,1.13437001893121]
[null,null,null,null,null,null,8,0.0124232308794734,1.91312992497075,0.437256846383418,0.433220774044035,0.000456570969391473,0.521367521367521,1.47678399357926,0.0732522350558588,0.0547130461517468,0.161321218512454,0.0677995080076351,0.76038338658147,1.62433951960196,0.867216187051025,1.54877231220712,1.47678399357926,0.454545454545455,-0.0122118181818182,1.29235404360755]
[null,null,null,null,null,null,9,0.0139761347394075,1.99885062896668,0.491661618674437,0.487624484832704,0.000456570969391473,0.521367521367521,1.51499313607354,0.0732522350558588,0.068169160814083,0.188436167020545,0.0677995080076351,0.76038338658147,1.65012212683246,0.889491584037871,1.54877231220712,1.51499313607354,0.511363636363636,-0.0137382954545454,1.43988115112394]
[null,null,null,null,null,null,10,0.0155290385993417,2.07992728663688,0.546066390965456,0.542028195621374,0.000456570969391473,0.521367521367521,1.55046855174558,0.0732522350558588,0.083095716341612,0.215551115528636,0.0677995080076351,0.76038338658147,1.67436645378728,0.910560178342185,1.54877231220712,1.55046855174558,0.568181818181818,-0.0152647727272727,1.57900607680198]
[null,null,null,null,null,null,11,0.0170819424592759,2.15704171769022,0.600471163256475,0.596431906410044,0.000456570969391473,0.521367521367521,1.58365232513765,0.0732522350558588,0.0994927127343338,0.242666064036727,0.0677995080076351,0.76038338658147,1.69728630224645,0.930599147751599,1.54877231220712,1.58365232513765,0.625,-0.01679125,1.71119814001137]
[null,null,null,null,null,null,12,0.01863484631921,2.2307236282179,0.654875935547494,0.650835617198713,0.000456570969391473,0.521367521367521,1.61488217629399,0.0732522350558588,0.117360149992248,0.269781012544818,0.0677995080076351,0.76038338658147,1.71905129167241,0.949746141782717,1.54877231220712,1.61488217629399,0.681818181818182,-0.0183177272727273,1.8375478551758]
[null,null,null,null,null,null,13,0.0201877501791442,2.30139426566694,0.709280707838513,0.705239327987383,0.000456570969391473,0.521367521367521,1.64442260600081,0.0732522350558588,0.136698028115356,0.296895961052909,0.0677995080076351,0.76038338658147,1.73979855622265,0.968110625870079,1.54877231220712,1.64442260600081,0.738636363636364,-0.0198442045454546,1.95888924015917]
[null,null,null,null,null,null,14,0.0217406540390784,2.36939517584798,0.763685480129532,0.759643038776053,0.000456570969391473,0.521367521367521,1.67248509486762,0.0732522350558588,0.157506347103656,0.324010909561,0.0677995080076351,0.76038338658147,1.75964075633877,0.985781354167195,1.54877231220712,1.67248509486762,0.795454545454545,-0.0213706818181818,2.07587609285909]
[null,null,null,null,null,null,15,0.0232935578990126,2.43500784148015,0.81809025242055,0.814046749564722,0.000456570969391473,0.521367521367521,1.69924170292188,0.0732522350558588,0.17978510695715,0.351125858069091,0.0677995080076351,0.76038338658147,1.77867172820349,1.00283147282221,1.54877231220712,1.69924170292188,0.852272727272727,-0.0228971590909091,2.18903163783729]
[null,null,null,null,null,null,16,0.0248464617589467,2.4984675052889,0.872495024711569,0.868450460353392,0.000456570969391473,0.521367521367521,1.72483451782261,0.0732522350558588,0.203534307675836,0.378240806577182,0.0677995080076351,0.76038338658147,1.79697056793357,1.01932211205049,1.54877231220712,1.72483451782261,0.909090909090909,-0.0244236363636364,2.29878201505451]
[null,null,null,null,null,null,17,0.0263993656188809,2.55997315341769,0.926899797002588,0.922854171142061,0.000456570969391473,0.521367521367521,1.74938239662502,0.0732522350558588,0.228753949259715,0.405355755085273,0.0677995080076351,0.76038338658147,1.81460464847485,1.03530498042576,1.54877231220712,1.74938239662502,0.965909090909091,-0.0259501136363636,2.40547956429348]
[null,null,null,null,null,null,18,0.0279522694788151,2.61969488745612,0.981304569293607,0.977257881930731,0.000456570969391473,0.521367521367521,1.77298588838232,0.0732522350558588,0.255444031708786,0.432470703593364,0.0677995080076351,0.76038338658147,1.83163189046172,1.05082428057654,1.54877231220712,1.77298588838232,1.02272727272727,-0.0274765909090908,2.50941944155292]
[null,null,null,null,null,null,19,0.0295051733387492,2.67777947437604,1.03570934158463,1.0316615927194,0.000456570969391473,0.521367521367521,1.79573090125582,0.0732522350558588,0.283604555023051,0.459585652101454,0.0677995080076351,0.76038338658147,1.84810250013551,1.06591815139355,1.54877231220712,1.79573090125582,1.07954545454545,-0.0290030681818181,2.61085174807275]
[null,null,null,null,null,null,20,0.0310580771986834,2.7343545963252,1.09011411387565,1.08606530350807,0.000456570969391473,0.521367521367521,1.81769148292188,0.0732522350558588,0.313235519202508,0.486700600609545,0.0677995080076351,0.76038338658147,1.86406031915835,1.08061977238183,1.54877231220712,1.81769148292188,1.13636363636364,-0.0305295454545456,2.70999056103229]
[null,null,null,null,null,null,21,0.0326109810586176,2.78953215422399,1.14451888616666,1.14046901429674,0.000456570969391473,0.521367521367521,1.83893196186715,0.0732522350558588,0.344336924247159,0.513815549117636,0.0677995080076351,0.76038338658147,1.87954388691599,1.09495822213393,1.54877231220712,1.83893196186715,1.19318181818182,-0.0320560227272728,2.80702077617218]
[null,null,null,null,null,null,22,0.0341638849185518,2.84341087057552,1.19892365845768,1.19487272508541,0.000456570969391473,0.521367521367521,1.85950861962896,0.0732522350558588,0.376908770157002,0.540930497625727,0.0677995080076351,0.76038338658147,1.89458728653542,1.10895915469661,1.54877231220712,1.85950861962896,1.25,-0.0335825,2.90210337394771]
[null,null,null,null,null,null,23,0.0357167887784859,2.89607836504516,1.2533284307487,1.24927643587408,0.000456570969391473,0.521367521367521,1.8794710131794,0.0732522350558588,0.410951056932038,0.568045446133818,0.0677995080076351,0.76038338658147,1.9092208259308,1.12264533893128,1.54877231220712,1.8794710131794,1.30681818181818,-0.0351089772727272,2.99537952940092]
[null,null,null,null,null,null,24,0.0372696926384201,2.94761282774533,1.30773320303972,1.30368014666275,0.000456570969391473,0.521367521367521,1.89886303253706,0.0732522350558588,0.446463784572267,0.595160394641909,0.0677995080076351,0.76038338658147,1.92347159142829,1.13603709333409,1.54877231220712,1.89886303253706,1.36363636363636,-0.0366354545454544,3.08697386023259]
[null,null,null,null,null,null,25,0.0388225964983543,2.99808438161113,1.36213797533074,1.35808385745142,0.000456570969391473,0.521367521367521,1.91772375534397,0.0732522350558588,0.483446953077688,0.62227534315,0.0677995080076351,0.76038338658147,1.93736390184271,1.14915264006312,1.54877231220712,1.91772375534397,1.42045454545455,-0.0381619318181819,3.17699702318606]
[null,null,null,null,null,null,26,0.0403755003582884,3.0475562016873,1.41654274762176,1.41248756824009,0.000456570969391473,0.521367521367521,1.93608814387577,0.0732522350558588,0.521900562448303,0.649390291658091,0.0677995080076351,0.76038338658147,1.9509196839644,1.16200839579642,1.54877231220712,1.93608814387577,1.47727272727273,-0.0396884090909092,3.26554781110768]
[null,null,null,null,null,null,27,0.0419284042182226,3.09608544232685,1.47094751991278,1.46689127902876,0.000456570969391473,0.521367521367521,1.95398761842763,0.0732522350558588,0.56182461268411,0.676505240166182,0.0677995080076351,0.76038338658147,1.96415878540463,1.17461921267408,1.54877231220712,1.95398761842763,1.53409090909091,-0.0412148863636364,3.35271486281487]
[null,null,null,null,null,null,28,0.0434813080781568,3.14372401111905,1.5253522922038,1.52129498981743,0.000456570969391473,0.521367521367521,1.97145053273001,0.0732522350558588,0.603219103785111,0.703620188674273,0.0677995080076351,0.76038338658147,1.97709923706765,1.18699857941121,1.54877231220712,1.97145053273001,1.59090909090909,-0.0427413636363636,3.43857806940977]
[null,null,null,null,null,null,29,0.0450342119380909,3.19051921942092,1.57975706449482,1.5756987006061,0.000456570969391473,0.521367521367521,1.9885025710057,0.0732522350558588,0.646084035751304,0.730735137182364,0.0677995080076351,0.76038338658147,1.98975747478267,1.19915879034527,1.54877231220712,1.9885025710057,1.64772727272727,-0.0442678409090908,3.52320974020085]
[null,null,null,null,null,null,30,0.0465871157980251,3.23651433271952,1.63416183678583,1.63010241139477,0.000456570969391473,0.521367521367521,2.00516708181792,0.0732522350558588,0.690419408582689,0.757850085690455,0.0677995080076351,0.76038338658147,2.00214852757288,1.2111110884532,1.54877231220712,2.00214852757288,1.70454545454545,-0.0457943181818181,3.60855024434425]
[null,null,null,null,null,null,31,0.0481400196579593,3.28174903905534,1.68856660907685,1.68450612218344,0.000456570969391473,0.521367521367521,2.02146536052666,0.0732522350558588,0.736225222279268,0.784965034198546,0.0677995080076351,0.76038338658147,2.01428617847691,1.22286578707609,1.54877231220712,2.01428617847691,1.76136363636364,-0.0473207954545455,3.67357618254786]
[null,null,null,null,null,null,32,0.0496929235178935,3.32625984994149,1.74297138136787,1.73890983297211,0.000456570969391473,0.521367521367521,2.03741688965397,0.0732522350558588,0.78350147684104,0.812079982706637,0.0677995080076351,0.76038338658147,2.02618310264064,1.23443237410205,1.54877231220712,2.02618310264064,1.81818181818182,-0.0488472727272728,3.73752966721066]
[null,null,null,null,null,null,33,{"$f":"(((G223/100)*Iout)*(Vout_nom^2)*2.5*Rsense*K_1)/(eff*(Vline^2)*K_FQ)*us","v":0.0512458273778276},{"$f":"(1*10^-9*(5*10^8*SQRT(fsw*kHz)+(1.09655978*10^10)*SQRT(ftyp)*SQRT(H223)))/SQRT(fsw*kHz)","v":3.37008044530067},{"$f":"(b_1^3/(27*a_1^3))-(d_1^3/27)+SQRT((ftyp)^2*H223^2/(4*a_1^2*c_1^2*(fsw*kHz)^2))+(b_1^3*(ftyp)*H223/(27*a_1^4*c_1*(fsw*kHz))-(d_1^3*(ftyp)*H223/(27*a_1*c_1*(fsw*kHz)))+(b_1*d_1^2*(ftyp)*H223/(9*a_1^2*c_1*(fsw*kHz)))-(b_1^2*d_1*(ftyp)*H223/(9*a_1^3*c_1*(fsw*kHz))))","v":1.79737615365889},{"$f":"(b_1*d_1^2/(9*a_1))-(b_1^2*d_1/(9*a_1^2))+(ftyp*H223/(2*a_1*c_1*fsw*kHz))","v":1.79331354376078},{"$f":"(d_1^2/9)+(b_1^2/(9*a_1^2))-(2*b_1*d_1/(9*a_1))","v":0.000456570969391473},{"$f":"((b_1*c_1*fsw*kHz)+(2*a_1*c_1*d_1*fsw*kHz))/(3*a_1*c_1*fsw*kHz)","v":0.521367521367521},2.05303954453976,{"$f":"(b_2^3/(27*a_2^3))-(d_2^3/27)","v":0.0732522350558588},{"$f":"(ftyp^2*H223^2/(4*a_2^2*c_2^2*(fsw*kHz)^2))+(b_2^3*ftyp*H223/(27*a_2^4*c_2*(fsw*kHz)))-(d_2^3*ftyp*H223/(27*a_2*c_2*(fsw*kHz)))+(b_2*d_2^2*ftyp*H223/(9*a_2^2*c_2*(fsw*kHz)))-(b_2^2*d_2*ftyp*H223/(9*a_2^3*c_2*(fsw*kHz)))","v":0.832248172268004},{"$f":"(b_2*d_2^2/(9*a_2))-(b_2^2*d_2/(9*a_2^2))+(ftyp*H223/(2*a_2*c_2*(fsw*kHz)))","v":0.839194931214728},{"$f":"(d_2^2/9)+(b_2^2/(9*a_2^2))-(2*b_2*d_2/(9*a_2))","v":0.0677995080076351},{"$f":"(b_2*c_2*(fsw*kHz)+2*a_2*c_2*d_2*(fsw*kHz))/(3*a_2*c_2*(fsw*kHz))","v":0.76038338658147},2.03785098647014,{"$f":"c_3+(SQRT(ftyp)*SQRT(H223)/(SQRT(a_3)*SQRT(b_3)*SQRT(fsw*kHz)))","v":1.24581960160163},{"$f":"(a_4*(fsw*kHz)*b_4/ftyp)","v":1.54877231220712},{"$f":"IF(I223>=0.5,IF(I223<1,I223,IF(N223>=1,IF(N223<2,N223,IF(VCOMP3>=2,IF(T223<4.5,T223,IF(U223>=4.5,IF(U223<4.6,U223,V223))))))))","v":2.03785098647014},{"$f":"Pin_max*G223/(Vline*100)","v":1.875},{"$f":"-Rsense*X223*1.414","v":-0.05037375},{"$f":"MIN(6,MAX(0.5,Beta*G*($Y223-Voff_trim)/(MAX(0,MIN(4.5,W223)-Alpha1_A)+MAX(0,MIN(4.5,W223)-Alpha1_B)-Alpha1_C)+Alpha2))","v":3.80047135473972}]
[null,null,null,null,null,null,34,0.0527987312377618,3.41324197168777,1.85178092594991,1.84771725454945,0.000456570969391473,0.521367521367521,2.06834977019226,0.0732522350558588,0.882465308560162,0.866309879722819,0.0677995080076351,0.76038338658147,2.04930063091354,1.25703556332397,1.54877231220712,2.04930063091354,1.93181818181818,-0.0519002272727272,3.86245638216182]
[null,null,null,null,null,null,35,0.054351635097696,3.4557733013053,1.90618569824093,1.90212096533811,0.000456570969391473,0.521367521367521,2.08336273409004,0.0732522350558588,0.934152885717512,0.89342482823091,0.0677995080076351,0.76038338658147,2.06054204137063,1.26808776200463,1.54877231220712,2.06054204137063,1.98863636363636,-0.0534267045454544,3.92353503825392]
[null,null,null,null,null,null,36,0.0559045389576302,3.49770125793335,1.96059047053195,1.95652467612678,0.000456570969391473,0.521367521367521,2.09809245879452,0.0732522350558588,0.987310903740055,0.920539776739001,0.0677995080076351,0.76038338658147,2.07158450627816,1.27898316807574,1.54877231220712,2.07158450627816,2.04545454545455,-0.0549531818181819,3.98375333446707]
[null,null,null,null,null,null,37,0.0574574428175643,3.53905081479747,2.01499524282297,2.01092838691545,0.000456570969391473,0.521367521367521,2.11255193752315,0.0732522350558588,1.04193936262779,0.947654725247091,0.0677995080076351,0.76038338658147,2.08243666605932,1.28972827108402,1.54877231220712,2.08243666605932,2.10227272727273,-0.0564796590909092,4.04315349315471]
[null,null,null,null,null,null,38,0.0590103466774985,3.57984526852035,2.06940001511398,2.06533209770412,0.000456570969391473,0.521367521367521,2.12675323527095,0.0732522350558588,1.09803826238072,0.974769673755182,0.0677995080076351,0.76038338658147,2.09310657383695,1.30032912489387,1.54877231220712,2.09310657383695,2.15909090909091,-0.0580061363636364,4.10177436714389]
[null,null,null,null,null,null,39,0.0605632505374327,3.62010639259836,2.123804787405,2.11973580849279,0.000456570969391473,0.521367521367521,2.14070757761754,0.0732522350558588,1.15560760299884,1.00188462226327,0.0677995080076351,0.76038338658147,2.10360174907667,1.31079138756984,1.54877231220712,2.10360174907667,2.21590909090909,-0.0595326136363636,4.15965180197934]
[null,null,null,null,null,null,40,0.0621161543973668,3.65985457327376,2.17820955969602,2.17413951928146,0.000456570969391473,0.521367521367521,2.15442542899448,0.0732522350558588,1.21464738448216,1.02899957077136,0.0677995080076351,0.76038338658147,2.11392922513645,1.32112035668437,1.54877231220712,2.11392922513645,2.27272727272727,-0.0610590909090908,4.2168189500444]
[null,null,null,null,null,null,41,0.063669058257301,3.69910893020933,2.23261433198704,2.22854323007013,0.000456570969391473,0.521367521367521,2.16791656189433,0.0732522350558588,1.27515760683066,1.05611451927946,0.0677995080076351,0.76038338658147,2.12409559154401,1.33132100067634,1.54877231220712,2.12409559154401,2.32954545454545,-0.0625855681818181,4.27330654407953]
[null,null,null,null,null,null,42,0.0652219621172352,3.73788742399285,2.28701910427806,2.2829469408588,0.000456570969391473,0.521367521367521,2.18119011826369,0.0732522350558588,1.33713827004436,1.08322946778755,0.0677995080076351,0.76038338658147,2.13410703169625,1.34139798678719,1.54877231220712,2.13410703169625,2.38636363636364,-0.0641120454545455,4.32914313627987]
[null,null,null,null,null,null,43,0.0667748659771693,3.77620695218679,2.34142387656908,2.33735065164747,0.000456570969391473,0.521367521367521,2.19425466412674,0.0732522350558588,1.40058937412326,1.11034441629564,0.0677995080076351,0.76038338658147,2.14396935656964,1.35135570602045,1.54877231220712,2.14396935656964,2.44318181818182,-0.0656385227272728,4.38435530807909]
[null,null,null,null,null,null,44,0.0683277698371035,3.81408343538044,2.3958286488601,2.39175436243614,0.000456570969391473,0.521367521367521,2.20711823832496,0.0732522350558588,1.46551091906734,1.13745936480373,0.0677995080076351,0.76038338658147,2.15368803494315,1.3611982955032,1.54877231220712,2.15368803494315,2.5,-0.067165,4.43896785486196]
[null,null,null,null,null,null,45,0.0698806736970377,3.8515318944878,2.45023342115112,2.44615807322481,0.000456570969391473,0.521367521367521,2.21978839612512,0.0732522350558588,1.53190290487662,1.16457431331182,0.0677995080076351,0.76038338658147,2.16326822056295,1.37092965857275,1.54877231220712,2.16326822056295,2.55681818181818,-0.0686914772727272,4.49300394914547]
[null,null,null,null,null,null,46,0.0714335775569719,3.88856652035562,2.50463819344214,2.50056178401348,0.000456570969391473,0.521367521367521,2.23227224833736,0.0732522350558588,1.59976533155109,1.19168926181991,0.0677995080076351,0.76038338658147,2.17271477661697,1.380553482865,1.54877231220712,2.17271477661697,2.61363636363636,-0.0702179545454544,4.54648528519732]
[null,null,null,null,null,null,47,0.072986481416906,3.92520073659647,2.55904296573316,2.55496549480215,0.000456570969391473,0.521367521367521,2.24457649649249,0.0732522350558588,1.66909819909076,1.218804210328,0.0677995080076351,0.76038338658147,2.18203229783635,1.39007325664224,1.54877231220712,2.18203229783635,2.67045454545455,-0.0717444318181819,4.59943220759128]
[null,null,null,null,null,null,48,0.0745393852768402,3.9614472564358,2.61344773802417,2.60936920559082,0.000456570969391473,0.521367521367521,2.2567074645505,0.0732522350558588,1.73990150749561,1.24591915883609,0.0677995080076351,0.76038338658147,2.19122513049799,1.39949228356543,1.54877231220712,2.19122513049799,2.72727272727273,-0.0732709090909092,4.65186382581353]
[null,null,null,null,null,null,49,0.0760922891367744,3.99731813425558,2.66785251031519,2.66377291637949,0.000456570969391473,0.521367521367521,2.26867112754707,0.0732522350558588,1.81217525676566,1.27303410734418,0.0677995080076351,0.76038338658147,2.20029739056539,1.40881369608837,1.54877231220712,2.20029739056539,2.78409090909091,-0.0747973863636364,4.70379811671504]
[null,null,null,null,null,null,50,0.0776451929967085,4.03282481242686,2.72225728260621,2.71817662716816,0.000456570969391473,0.521367521367521,2.28047313752973,0.0732522350558588,1.88591944690091,1.30014905585227,0.0677995080076351,0.76038338658147,2.20925298017451,1.41804046762756,1.54877231220712,2.20925298017451,2.84090909090909,-0.0763238636363636,4.75525201633968]
[null,null,null,null,null,null,51,0.0791980968566427,4.06797816394732,2.77666205489723,2.77258033795683,0.000456570969391473,0.521367521367521,2.2921188470891,0.0732522350558588,1.96113407790134,1.32726400436036,0.0677995080076351,0.76038338658147,2.21809560264445,1.42717542364208,1.54877231220712,2.21809560264445,2.89772727272727,-0.0778503409090908,4.80624150243678]
[null,null,null,null,null,null,52,0.0807510007165769,4.10278853133387,2.83106682718825,2.8269840487455,0.000456570969391473,0.521367521367521,2.3036133307505,0.0732522350558588,2.03781914976697,1.35437895286846,0.0677995080076351,0.76038338658147,2.22682877617058,1.43622125174016,1.54877231220712,2.22682877617058,2.95454545454545,-0.0793768181818181,4.85678166878176]
[null,null,null,null,null,null,53,0.0823039045765111,4.13726576216488,2.88547159947927,2.88138775953417,0.000456570969391473,0.521367521367521,2.31496140445791,0.0732522350558588,2.11597466249779,1.38149390137655,0.0677995080076351,0.76038338658147,2.23545584633788,1.44518051091521,1.54877231220712,2.23545584633788,3.01136363636364,-0.0809032954545455,4.9068867922721]
[null,null,null,null,null,null,54,0.0838568084364452,4.17141924161799,2.93987637177029,2.93579147032284,0.000456570969391473,0.521367521367521,2.3261676433527,0.0732522350558588,2.1956006160938,1.40860884988464,0.0677995080076351,0.76038338658147,2.24397999757597,1.45405564000114,1.54877231220712,2.24397999757597,3.06818181818182,-0.0824297727272728,4.95657039363502]
[null,null,null,null,null,null,55,0.0854097122963794,4.20525792230835,2.99428114406131,2.99019518111151,0.000456570969391473,0.521367521367521,2.33723639802532,0.0732522350558588,2.27669701055501,1.43572379839273,0.0677995080076351,0.76038338658147,2.25240426366256,1.46284896542605,1.54877231220712,2.25240426366256,3.125,-0.08395625,5.00584529247141]
[null,null,null,null,null,null,56,0.0869626161563136,4.23879035169596,3.04868591635233,3.04459889190018,0.000456570969391473,0.521367521367521,2.34817180939612,0.0732522350558588,2.35926384588141,1.46283874690082,0.0677995080076351,0.76038338658147,2.26073153736986,1.47156270833439,1.54877231220712,2.26073153736986,3.18181818181818,-0.0854827272727272,5.05472365726585]
[null,null,null,null,null,null,57,0.0885155200162477,4.27202469729995,3.10309068864334,3.09900260268885,0.000456570969391473,0.521367521367521,2.35897782236335,0.0732522350558588,2.443301122073,1.48995369540891,0.0677995080076351,0.76038338658147,2.26896457933726,1.48019899113909,1.54877231220712,2.26896457933726,3.23863636363636,-0.0870092045454545,5.1032170509121]
[null,null,null,null,null,null,58,0.0900684238761819,4.30496876993054,3.15749546093436,3.15340631347752,0.000456570969391473,0.521367521367521,2.36965819834012,0.0732522350558588,2.52880883912979,1.517068643917,0.0677995080076351,0.76038338658147,2.27710602624471,1.48875984355865,1.54877231220712,2.27710602624471,3.29545454545455,-0.0885356818181819,5.15133647223389]
[null,null,null,null,null,null,59,0.0916213277361161,4.33763004512586,3.21190023322538,3.20781002426619,0.000456570969391473,0.521367521367521,2.38021652678839,0.0732522350558588,2.61578699705177,1.54418359242509,0.0677995080076351,0.76038338658147,2.28515839835241,1.4972472081877,1.54877231220712,2.28515839835241,3.35227272727273,-0.0900621590909092,5.19909239392183]
[null,null,null,null,null,null,60,0.0931742315960502,4.3700156829603,3.2663050055164,3.26221373505486,0.000456570969391473,0.521367521367521,2.39065623584561,0.0732522350558588,2.70423559583894,1.57129854093318,0.0677995080076351,0.76038338658147,2.29312410646578,1.50566294564441,1.54877231220712,2.29312410646578,3.40909090909091,-0.0915886363636364,5.24649479725629]
[null,null,null,null,null,null,61,0.0947271354559844,4.40213254637316,3.32070977780742,3.31661744584353,0.000456570969391473,0.521367521367521,2.40098060212941,0.0732522350558588,2.79415463549131,1.59841348944127,0.0677995080076351,0.76038338658147,2.30100545837791,1.51400883933338,1.54877231220712,2.30100545837791,3.46590909090909,-0.0931151136363636,5.29355320394155]
[null,null,null,null,null,null,62,0.0962800393159186,4.43398721815039,3.37511455009844,3.37102115663219,0.000456570969391473,0.521367521367521,2.41119275979623,0.0732522350558588,2.88554411600886,1.62552843794937,0.0677995080076351,0.76038338658147,2.30880466483648,1.52228659985851,1.54877231220712,2.30880466483648,3.52272727272727,-0.0946415909090908,5.340276705339]
[null,null,null,null,null,null,63,0.0978329431758528,4.46558601667857,3.42951932238946,3.42542486742086,0.000456570969391473,0.521367521367521,2.42129570892164,0.0732522350558588,2.97840403739161,1.65264338645746,0.0677995080076351,0.76038338658147,2.31652384507714,1.53049786911682,1.54877231220712,2.31652384507714,3.57954545454545,-0.0961680681818181,5.38667398935361]
[null,null,null,null,null,null,64,0.0993858470357869,4.4969350105778,3.48392409468048,3.47982857820953,0.000456570969391473,0.521367521367521,2.43129232326322,0.0732522350558588,3.07273439963955,1.67975833496555,0.0677995080076351,0.76038338658147,2.324165031961,1.53864422410099,1.54877231220712,2.324165031961,3.63636363636364,-0.0976945454545455,5.43275336519946]
[null,null,null,null,null,null,65,{"$f":"(((G255/100)*Iout)*(Vout_nom^2)*2.5*Rsense*K_1)/(eff*(Vline^2)*K_FQ)*us","v":0.100938750895721},{"$f":"(1*10^-9*(5*10^8*SQRT(fsw*kHz)+(1.09655978*10^10)*SQRT(ftyp)*SQRT(H255)))/SQRT(fsw*kHz)","v":4.52804003230958},{"$f":"(b_1^3/(27*a_1^3))-(d_1^3/27)+SQRT((ftyp)^2*H255^2/(4*a_1^2*c_1^2*(fsw*kHz)^2))+(b_1^3*(ftyp)*H255/(27*a_1^4*c_1*(fsw*kHz))-(d_1^3*(ftyp)*H255/(27*a_1*c_1*(fsw*kHz)))+(b_1*d_1^2*(ftyp)*H255/(9*a_1^2*c_1*(fsw*kHz)))-(b_1^2*d_1*(ftyp)*H255/(9*a_1^3*c_1*(fsw*kHz))))","v":3.5383288669715},{"$f":"(b_1*d_1^2/(9*a_1))-(b_1^2*d_1/(9*a_1^2))+(ftyp*H255/(2*a_1*c_1*fsw*kHz))","v":3.5342322889982},{"$f":"(d_1^2/9)+(b_1^2/(9*a_1^2))-(2*b_1*d_1/(9*a_1))","v":0.000456570969391473},{"$f":"((b_1*c_1*fsw*kHz)+(2*a_1*c_1*d_1*fsw*kHz))/(3*a_1*c_1*fsw*kHz)","v":0.521367521367521},2.4411853574602,{"$f":"(b_2^3/(27*a_2^3))-(d_2^3/27)","v":0.0732522350558588},{"$f":"(ftyp^2*H255^2/(4*a_2^2*c_2^2*(fsw*kHz)^2))+(b_2^3*ftyp*H255/(27*a_2^4*c_2*(fsw*kHz)))-(d_2^3*ftyp*H255/(27*a_2*c_2*(fsw*kHz)))+(b_2*d_2^2*ftyp*H255/(9*a_2^2*c_2*(fsw*kHz)))-(b_2^2*d_2*ftyp*H255/(9*a_2^3*c_2*(fsw*kHz)))","v":3.16853520275269},{"$f":"(b_2*d_2^2/(9*a_2))-(b_2^2*d_2/(9*a_2^2))+(ftyp*H255/(2*a_2*c_2*(fsw*kHz)))","v":1.70687328347364},{"$f":"(d_2^2/9)+(b_2^2/(9*a_2^2))-(2*b_2*d_2/(9*a_2))","v":0.0677995080076351},{"$f":"(b_2*c_2*(fsw*kHz)+2*a_2*c_2*d_2*(fsw*kHz))/(3*a_2*c_2*(fsw*kHz))","v":0.76038338658147},2.33173017675017,{"$f":"c_3+(SQRT(ftyp)*SQRT(H255)/(SQRT(a_3)*SQRT(b_3)*SQRT(fsw*kHz)))","v":1.54672718043547},{"$f":"(a_4*(fsw*kHz)*b_4/ftyp)","v":1.54877231220712},{"$f":"IF(I255>=0.5,IF(I255<1,I255,IF(N255>=1,IF(N255<2,N255,IF(VCOMP3>=2,IF(T255<4.5,T255,IF(U255>=4.5,IF(U255<4.6,U255,V255))))))))","v":2.33173017675017},{"$f":"Pin_max*G255/(Vline*100)","v":3.69318181818182},{"$f":"-Rsense*X255*1.414","v":-0.0992210227272728},{"$f":"MIN(6,MAX(0.5,Beta*G*($Y255-Voff_trim)/(MAX(0,MIN(4.5,W255)-Alpha1_A)+MAX(0,MIN(4.5,W255)-Alpha1_B)-Alpha1_C)+Alpha2))","v":5.47852278624451}]
[null,null,null,null,null,null,66,0.102491654755655,4.55890669084602,3.59273363926251,3.58863599978687,0.000456570969391473,0.521367521367521,{"$f":"(J256+K256)^(1/3)+(L256/(J256^(1/3)))+M256","v":2.45097745371884},0.0732522350558588,3.26580644673102,1.73398823198173,0.0677995080076351,0.76038338658147,{"$f":"((O256+SQRT(P256)+Q256)^(1/3))+(R256/((O256+SQRT(P256)+Q256)^(1/3)))+S256","v":2.33922115355187},1.55474819566872,1.54877231220712,2.33922115355187,3.75,-0.1007475,5.52398987111365]
[null,null,null,null,null,null,67,0.104044558615589,4.58954038347839,3.64713841155353,3.64303971057554,0.000456570969391473,0.521367521367521,2.46067114802752,0.0732522350558588,3.36454813157454,1.76110318048982,0.0677995080076351,0.76038338658147,2.34663976345867,1.56270867234179,1.54877231220712,2.34663976345867,3.80681818181818,-0.102273977272727,5.56916192320883]
[null,null,null,null,null,null,68,0.105597462475524,4.61994630683538,3.70154318384455,3.69744342136421,0.000456570969391473,0.521367521367521,2.47026887594095,0.0732522350558588,3.46476025728325,1.78821812899791,0.0677995080076351,0.76038338658147,2.35398773840971,1.57060996085152,1.54877231220712,2.35398773840971,3.86363636363636,-0.103800454545454,5.61404594878899]
[null,null,null,null,null,null,69,0.107150366335458,4.65012946717479,3.75594795613557,3.75184713215288,0.000456570969391473,0.521367521367521,2.47977297796941,0.0732522350558588,3.56644282385716,1.815333077506,0.0677995080076351,0.76038338658147,2.36126674479549,1.57845336212491,1.54877231220712,2.36126674479549,3.92045454545455,-0.105326931818182,5.65864867373739]
[null,null,null,null,null,null,70,0.108703270195392,4.68009469000625,3.81035272842659,3.80625084294155,0.000456570969391473,0.521367521367521,2.48918570460522,0.0732522350558588,3.66959583129626,1.84244802601409,0.0677995080076351,0.76038338658147,2.3684783868265,1.58624013011975,1.54877231220712,2.3684783868265,3.97727272727273,-0.106853409090909,5.70297655913052]
[null,null,null,null,null,null,71,0.110256174055326,4.7098466290976,3.86475750071761,3.86065455373022,0.000456570969391473,0.521367521367521,2.49850922101565,0.0732522350558588,3.77421927960055,1.86956297452218,0.0677995080076351,0.76038338658147,2.37562420968445,1.59397147416494,1.54877231220712,2.37562420968445,4.03409090909091,-0.108379886363636,5.74703581571187]
[null,null,null,null,null,null,72,0.11180907791526,4.73938977491224,3.91916227300863,3.91505826451889,0.000456570969391473,0.521367521367521,2.5077456114289,0.0732522350558588,3.88031316877004,1.89667792303027,0.0677995080076351,0.76038338658147,2.38270570247272,1.60164856115308,1.54877231220712,2.38270570247272,4.09090909090909,-0.109906363636364,5.79083241736281]
[null,null,null,null,null,null,73,0.113361981775194,4.76872846252094,3.97356704529965,3.96946197530756,0.000456570969391473,0.521367521367521,2.51689688323699,0.0732522350558588,3.98787749880472,1.92379287153837,0.0677995080076351,0.76038338658147,2.38972430098146,1.60927251759641,1.54877231220712,2.38972430098146,4.14772727272727,-0.111432840909091,5.83437211365429]
[null,null,null,null,null,null,74,0.114914885635129,4.79786687902759,4.02797181759067,4.02386568609623,0.000456570969391473,0.521367521367521,2.52596497083759,0.0732522350558588,4.09691226970459,1.95090782004646,0.0677995080076351,0.76038338658147,2.39668139028127,1.61684443155648,1.54877231220712,2.39668139028127,4.20454545454545,-0.112959318181818,5.87766044155484]
[null,null,null,null,null,null,75,0.116467789495063,4.82680907054475,4.08237658988168,4.0782693968849,0.000456570969391473,0.521367521367521,2.53495173923472,0.0732522350558588,4.20741748146965,1.97802276855455,0.0677995080076351,0.76038338658147,2.40357830715823,1.62436535445679,1.54877231220712,2.40357830715823,4.26136363636364,-0.114485795454546,5.92070273636295]
[null,null,null,null,null,null,76,0.118020693354997,4.85555894875208,4.1367813621727,4.13267310767357,0.000456570969391473,0.521367521367521,2.54385898741625,0.0732522350558588,4.31939313409991,2.00513771706264,0.0677995080076351,0.76038338658147,2.41041634240196,1.63183630278711,1.54877231220712,2.41041634240196,4.31818181818182,-0.116012272727273,5.96350414192583]
[null,null,null,null,null,null,77,0.119573597214931,4.88412029706762,4.19118613446372,4.18707681846224,0.000456570969391473,0.521367521367521,2.55268845152504,0.0732522350558588,4.43283922759536,2.03225266557073,0.0677995080076351,0.76038338658147,2.4171967429572,1.63925825970709,1.54877231220712,2.4171967429572,4.375,-0.11753875,6]
[null,null,null,null,null,null,78,0.121126501074865,4.91249677645959,4.24559090675474,4.24148052925091,0.000456570969391473,0.521367521367521,2.56144180783865,0.0732522350558588,4.547755761956,2.05936761407882,0.0677995080076351,0.76038338658147,2.42392071394884,1.64663217655657,1.54877231220712,2.42392071394884,4.43181818181818,-0.119065227272727,6]
[null,null,null,null,null,null,79,0.1226794049348,4.94069193092386,4.29999567904576,4.29588424003958,0.000456570969391473,0.521367521367521,2.57012067557153,0.0732522350558588,4.66414273718184,2.08648256258691,0.0677995080076351,0.76038338658147,2.43058942058933,1.65395897427894,1.54877231220712,2.43058942058933,4.48863636363636,-0.120591704545454,6]
[null,null,null,null,null,null,80,0.124232308794734,4.96870919265041,4.35440045133678,4.35028795082825,0.000456570969391473,0.521367521367521,2.57872661951239,0.0732522350558588,4.78200015327286,2.113597511095,0.0677995080076351,0.76038338658147,2.43720398997648,1.66123954476367,1.54877231220712,2.43720398997648,4.54545454545455,-0.122118181818182,6]
[null,null,null,null,null,null,81,0.125785212654668,4.99655188690003,4.4088052236278,4.40469166161692,0.000456570969391473,0.521367521367521,2.58726115250837,0.0732522350558588,4.90132801022908,2.14071245960309,0.0677995080076351,0.76038338658147,2.44376551278945,1.66847475211361,1.54877231220712,2.44376551278945,4.60227272727273,-0.123644659090909,6]
[null,null,null,null,null,null,82,0.127338116514602,5.02422323661092,4.46320999591882,4.45909537240559,0.000456570969391473,0.521367521367521,2.59572573780663,0.0732522350558588,5.0221263080505,2.16782740811118,0.0677995080076351,0.76038338658147,2.45027504488972,1.67566543384205,1.54877231220712,2.45027504488972,4.65909090909091,-0.125171136363636,6]
[null,null,null,null,null,null,83,0.128891020374536,5.05172636675319,4.51761476820984,4.51349908319426,0.000456570969391473,0.521367521367521,2.60412179126323,0.0732522350558588,5.1443950467371,2.19494235661927,0.0677995080076351,0.76038338658147,2.45673360883345,1.68281240200424,1.54877231220712,2.45673360883345,4.71590909090909,-0.126697613636364,6]
[null,null,null,null,null,null,84,0.13044392423447,5.07906430844798,4.57201954050086,4.56790279398293,0.000456570969391473,0.521367521367521,2.61245068342838,0.0732522350558588,5.2681342262889,2.22205730512737,0.0677995080076351,0.76038338658147,2.46314219530112,1.68991644426787,1.54877231220712,2.46314219530112,4.77272727272727,-0.128224090909091,6]
[null,null,null,null,null,null,85,0.131996828094404,5.10624000286656,4.62642431279187,4.6223065047716,0.000456570969391473,0.521367521367521,2.62071374151619,0.0732522350558588,5.3933438467059,2.24917225363546,0.0677995080076351,0.76038338658147,2.46950176444991,1.69697832492619,1.54877231220712,2.46950176444991,4.82954545454545,-0.129750568181818,6]
[null,null,null,null,null,null,86,0.133549731954339,5.13325630492358,4.68082908508289,4.67671021556027,0.000456570969391473,0.521367521367521,2.62891225126674,0.0732522350558588,5.52002390798808,2.27628720214355,0.0677995080076351,0.76038338658147,2.47581324719385,1.70399878585784,1.54877231220712,2.47581324719385,4.88636363636364,-0.131277045454546,6]
[null,null,null,null,null,null,87,0.135102635814273,5.16011598677759,4.73523385737391,4.73111392634894,0.000456570969391473,0.521367521367521,2.63704745870757,0.0732522350558588,5.64817441013546,2.30340215065164,0.0677995080076351,0.76038338658147,2.48207754641624,1.71097854743641,1.54877231220712,2.48207754641624,4.94318181818182,-0.132803522727273,6]
[null,null,null,null,null,null,88,0.136655539674207,5.18682174115104,4.78963862966493,4.78551763713761,0.000456570969391473,0.521367521367521,2.6451205718209,0.0732522350558588,5.77779535314803,2.33051709915973,0.0677995080076351,0.76038338658147,2.4882955381189,1.71791830939322,1.54877231220712,2.4882955381189,5,-0.13433,6]
[null,null,null,null,null,null,89,0.138208443534141,5.21337618448093,4.84404340195595,4.83992134792627,0.000456570969391473,0.521367521367521,2.65313276212292,0.0732522350558588,5.90888673702579,2.35763204766782,0.0677995080076351,0.76038338658147,2.49446807251192,1.72481875163604,1.54877231220712,2.49446807251192,5.05681818181818,-0.135856477272727,6]
[null,null,null,null,null,null,90,0.139761347394075,5.23978185991065,4.89844817424697,4.89432505871494,0.000456570969391473,0.521367521367521,2.66108516616045,0.0732522350558588,6.04144856176875,2.38474699617591,0.0677995080076351,0.76038338658147,2.50059597504782,1.73168053502656,1.54877231220712,2.50059597504782,5.11363636363636,-0.137382954545454,6]
[null,null,null,null,null,null,91,0.14131425125401,5.26604124013253,4.95285294653799,4.94872876950361,0.000456570969391473,0.521367521367521,2.66897888693039,0.0732522350558588,6.1754808273769,2.411861944684,0.0677995080076351,0.76038338658147,2.50668004740342,1.73850430211903,1.54877231220712,2.50668004740342,5.17045454545455,-0.138909431818182,6]
[null,null,null,null,null,null,92,0.142867155113944,5.29215673009032,5.00725771882901,5.00313248029228,0.000456570969391473,0.521367521367521,2.67681499522655,0.0732522350558588,6.31098353385024,2.43897689319209,0.0677995080076351,0.76038338658147,2.5127210684127,1.74529067786255,1.54877231220712,2.5127210684127,5.22727272727273,-0.140435909090909,6]
[null,null,null,null,null,null,93,0.144420058973878,5.31813066954976,5.06166249112003,5.05753619108095,0.000456570969391473,0.521367521367521,2.68459453091848,0.0732522350558588,6.44795668118878,2.46609184170018,0.0677995080076351,0.76038338658147,2.51871979495341,1.75204027026906,1.54877231220712,2.51871979495341,5.28409090909091,-0.141962386363636,6]
[null,null,null,null,null,null,94,0.145972962833812,5.34396533554504,5.11606726341105,5.11193990186962,0.000456570969391473,0.521367521367521,2.69231850416632,0.0732522350558588,6.58640026939251,2.49320679020827,0.0677995080076351,0.76038338658147,2.52467696279044,1.75875367104905,1.54877231220712,2.52467696279044,5.34090909090909,-0.143488863636364,6]
[null,null,null,null,null,null,95,0.147525866693746,5.36966294470859,5.17047203570206,5.16634361265829,0.000456570969391473,0.521367521367521,2.69998789657557,0.0732522350558588,6.72631429846143,2.52032173871637,0.0677995080076351,0.76038338658147,2.53059328737819,1.765431456217,1.54877231220712,2.53059328737819,5.39772727272727,-0.145015340909091,6]
[null,null,null,null,null,null,96,0.14907877055368,5.39522565549065,5.22487680799308,5.22074732344696,0.000456570969391473,0.521367521367521,2.70760366229531,0.0732522350558588,6.86769876839554,2.54743668722446,0.0677995080076351,0.76038338658147,2.53646946462469,1.77207418666818,1.54877231220712,2.53646946462469,5.45454545454545,-0.146541818181818,6]
[null,null,null,null,null,null,97,{"$f":"(((G287/100)*Iout)*(Vout_nom^2)*2.5*Rsense*K_1)/(eff*(Vline^2)*K_FQ)*us","v":0.150631674413615},{"$f":"(1*10^-9*(5*10^8*SQRT(fsw*kHz)+(1.09655978*10^10)*SQRT(ftyp)*SQRT(H287)))/SQRT(fsw*kHz)","v":5.42065557027515},5.2792815802841,5.27515103423563,0.000456570969391473,0.521367521367521,2.71516672906323,0.0732522350558588,7.01055367919485,2.57455163573255,0.0677995080076351,0.76038338658147,2.54230617161927,1.77868240872844,1.54877231220712,{"$f":"IF(I287>=0.5,IF(I287<1,I287,IF(N287>=1,IF(N287<2,N287,IF(VCOMP3>=2,IF(T287<4.5,T287,IF(U287>=4.5,IF(U287<4.6,U287,V287))))))))","v":2.54230617161927},5.51136363636364,{"$f":"-Rsense*X287*1.414","v":-0.148068295454546},6]
[null,null,null,null,null,null,98,{"$f":"(((G288/100)*Iout)*(Vout_nom^2)*2.5*Rsense*K_1)/(eff*(Vline^2)*K_FQ)*us","v":0.152184578273549},{"$f":"(1*10^-9*(5*10^8*SQRT(fsw*kHz)+(1.09655978*10^10)*SQRT(ftyp)*SQRT(H288)))/SQRT(fsw*kHz)","v":5.44595473739761},5.33368635257512,5.3295547450243,0.000456570969391473,0.521367521367521,2.72267799920059,0.0732522350558588,7.15487903085935,2.60166658424064,0.0677995080076351,0.76038338658147,2.54810406732619,1.78525665467859,1.54877231220712,{"$f":"IF(I288>=0.5,IF(I288<1,I288,IF(N288>=1,IF(N288<2,N288,IF(VCOMP3>=2,IF(T288<4.5,T288,IF(U288>=4.5,IF(U288<4.6,U288,V288))))))))","v":2.54810406732619},5.56818181818182,{"$f":"-Rsense*X288*1.414","v":-0.149594772727273},6]
[null,null,null,null,null,null,99,{"$f":"(((G289/100)*Iout)*(Vout_nom^2)*2.5*Rsense*K_1)/(eff*(Vline^2)*K_FQ)*us","v":0.153737482133483},{"$f":"(1*10^-9*(5*10^8*SQRT(fsw*kHz)+(1.09655978*10^10)*SQRT(ftyp)*SQRT(H289)))/SQRT(fsw*kHz)","v":5.47112515307067},5.38809112486614,5.38395845581297,0.000456570969391473,0.521367521367521,2.73013835055992,0.0732522350558588,7.30067482338904,2.62878153274873,0.0677995080076351,0.76038338658147,2.55386379324603,1.7917974432548,1.54877231220712,{"$f":"IF(I289>=0.5,IF(I289<1,I289,IF(N289>=1,IF(N289<2,N289,IF(VCOMP3>=2,IF(T289<4.5,T289,IF(U289>=4.5,IF(U289<4.6,U289,V289))))))))","v":2.55386379324603},5.625,{"$f":"-Rsense*X289*1.414","v":-0.15112125},6]
[null,null,null,null,null,null,100,{"$f":"(((G290/100)*Iout)*(Vout_nom^2)*2.5*Rsense*K_1)/(eff*(Vline^2)*K_FQ)*us","v":0.155290385993417},{"$f":"(1*10^-9*(5*10^8*SQRT(fsw*kHz)+(1.09655978*10^10)*SQRT(ftyp)*SQRT(H290)))/SQRT(fsw*kHz)","v":5.49616876322226},5.44249589715716,5.43836216660164,0.000456570969391473,0.521367521367521,2.73754863742817,0.0732522350558588,7.44794105678393,2.65589648125682,0.0677995080076351,0.76038338658147,2.55958597404655,1.79830528012624,1.54877231220712,{"$f":"IF(I290>=0.5,IF(I290<1,I290,IF(N290>=1,IF(N290<2,N290,IF(VCOMP3>=2,IF(T290<4.5,T290,IF(U290>=4.5,IF(U290<4.6,U290,V290))))))))","v":2.55958597404655},5.68181818181818,{"$f":"-Rsense*X290*1.414","v":-0.152647727272727},6]

{"sheet":"Sheet1","index":4,"n_rows":23,"n_cols":7,"rows_kept":23,"cut":false,"hidden":true,"merged":[]}
[]
[]
[null,"f",{"$f":"3.57*10^6","v":3570000},"Hz",{"$f":"95.41*10^6","v":95410000}]
[null,"Ciss",{"$f":"9250*10^-12","v":9.25e-9},"F",{"$f":"1661*10^-12","v":1.661e-9}]
[null,"LS",{"$f":"1/C4/((2*PI()*C3)^2)","v":2.14863229112181e-7},"H",{"$f":"1/E4/((2*PI()*E3)^2)","v":1.67526239206403e-9}]
[null,"RG*1",{"$f":"2*PI()*C5*C3-1.4","v":3.41959097863261},null,{"$f":"2*PI()*E5*E3-1.4","v":-0.395715862029241}]
[null,"RG*2",{"$f":"2*C6-1.4","v":5.43918195726522},null,{"$f":"2*E6-1.4","v":-2.19143172405848}]
[]
[null,null,{"$f":"102*10^-9*44.4*10^6","v":4.5288}]
[]
["温升对策案1："]
["电压变动：",null,"AC","AC","P电压","PFC输出电压","差值"]
[null,"第一档",{"$f":"220*0.8","v":176},200,{"$f":"D13*SQRT(2)","v":282.842712474619},290,{"$f":"F13-E13","v":7.15728752538098}]
[null,"第二档",{"$f":"D13","v":200},{"$f":"C14*1.15","v":230},{"$f":"D14*SQRT(2)","v":325.269119345812},332,{"$f":"F14-E14","v":6.73088065418818}]
[null,"第三档",{"$f":"D14","v":230},264,{"$f":"D15*SQRT(2)","v":373.352380466497},380,{"$f":"F15-E15","v":6.6476195335029}]
["电压变动特性："]
[null,"仅在初期设定，后期不变。"]
[]
[]
[]
[]
[null,null,183,{"$f":"(C23-C22)*0.5+C22","v":220.5}]
[null,null,258]

{"sheet":"Sheet2","index":5,"n_rows":10,"n_cols":7,"rows_kept":10,"cut":false,"hidden":true,"merged":[]}
[]
[]
[]
[]
[]
[null,null,null,"方案","案1","案2","案3"]
[null,null,null,"具体措施","降低PFC过电流检测阈值\nRSENSE：12mΩ→18mΩ\nI_SOC：21.85A→13.63A\nI_PCL：36.50A→23.05A","新增外围过电流检知回路。\n同时，提升MOS管规格（ID：50A 100uS→120A 100us品)","更换PFC控制芯片：\nTI制：UCC28180DR\nON（安森美）制：NCP1654BD65R2G\n高精度过电流限制品。\nI_OCP：36.50A→11.1A\n\n其他部品：MOS管，二极管同之前TI方案，仅反馈回路微调。"]
[null,null,null,"Q","NG。\n理由：ICOMP ＞5.7V，ICOMP 电流饱和，电流环乘法器失效，固定输出占空比，容易发生过电流。\n※该阈值仅支持在输入85VAC下设定，输入电压越大，阈值越高。","TI厂家建议。\n需要程序配合，程序计算量加大。\n（cycle by cycle可否要确认）","他社（洲钜）有使用实绩。"]
[null,null,null,"C","\\"," +4.090元"]
[null,null,null,"D","\\","型品2次试作验证。","型品2次试作体现。"]