导入TI例程,编译出错

/*下面是编译日志*/

**** Build of configuration Debug for project pinStandby_CC1312R1_LAUNCHXL_tirtos_ccs ****

"C:\\ti\\ccs910\\ccs\\utils\\bin\\gmake" -k -j 2 all -O

Building file: "../pinStandby.syscfg"
Invoking: SysConfig
"C:/ti/ccs910/ccs/utils/sysconfig/sysconfig_cli.bat" -s "C:/ti/simplelink_cc13x2_26x2_sdk_3_30_00_03/.metadata/product.json" -o "syscfg" "../pinStandby.syscfg"
Running script...
subdir_rules.mk:19: recipe for target 'build-1840319823-inproc' failed
Error: Exception occurred calling addInstance()
at Proxy.r (C:\ti\ccs910\ccs\utils\sysconfig\dist\cli.js:105:351706)
at eval (E:\Juszou\WorkSpace\pinStandby_CC1312R1_LAUNCHXL_tirtos_ccs\pinStandby.syscfg:45:16)
at n.each (C:\ti\ccs910\ccs\utils\sysconfig\dist\cli.js:105:323229)
at Jt (C:\ti\ccs910\ccs\utils\sysconfig\dist\cli.js:9:5263)
at Function.Gs (C:\ti\ccs910\ccs\utils\sysconfig\dist\cli.js:9:40233)
at i.getSysConfig.then.r (C:\ti\ccs910\ccs\utils\sysconfig\dist\cli.js:105:323113)
at <anonymous>
Caused by: Error: Configurable "$hardware" of "/ti/drivers/PIN" is of an unknown schema type
at Object.t.createMetaContentConfigurableMgr (C:\ti\ccs910\ccs\utils\sysconfig\dist\cli.js:80:69311)
at I.s.addMetaContentConfigurableMgrs.i.map.e (C:\ti\ccs910\ccs\utils\sysconfig\dist\cli.js:112:37196)
at rr (C:\ti\ccs910\ccs\utils\sysconfig\dist\cli.js:9:5791)
at Function.Js [as map] (C:\ti\ccs910\ccs\utils\sysconfig\dist\cli.js:9:40569)
at new I (C:\ti\ccs910\ccs\utils\sysconfig\dist\cli.js:112:37185)
at Function.createInstance (C:\ti\ccs910\ccs\utils\sysconfig\dist\cli.js:112:38164)
at o.internalBoundary (C:\ti\ccs910\ccs\utils\sysconfig\dist\cli.js:9:143916)
at Object.t.internalBoundary (C:\ti\ccs910\ccs\utils\sysconfig\dist\cli.js:105:320464)
at t.ModuleMgr.addInstance (C:\ti\ccs910\ccs\utils\sysconfig\dist\cli.js:9:143875)
at addFixedMember.o.guardScriptingFunction.e (C:\ti\ccs910\ccs\utils\sysconfig\dist\cli.js:80:161126)
gmake[1]: *** [build-1840319823-inproc] Error 1
subdir_rules.mk:16: recipe for target 'build-1840319823' failed
gmake: *** [build-1840319823] Error 2
gmake: Target 'all' not remade because of errors.

**** Build Finished ****

/*编译errors*/

Exception occurred calling addInstance()

gmake: *** [build-1840319823] Error 2

gmake: Target 'all' not remade because of errors.

gmake[1]: *** [build-1840319823-inproc] Error 1 

1 个回复