CC1310网关方案 3358编译bbb报错

请教大家一个问题:

我在编译AM3358SDK时,在执行 ./build_all.sh  bbb 报如下错误,找不到bbb的编译器,请问这个要怎么下载。

执行 ./build_all.sh  可以通过

~/ti/ti154stack_linux_x64_2_09_00_09/components/common ~/ti/ti154stack_linux_x64_2_09_00_09
make -f Makefile ARCH=bbb
make[1]: Entering directory '/home/book/ti/ti154stack_linux_x64_2_09_00_09/components/common'
Cannot find BBB Compiler: /home/book/ti-processor-sdk-linux-am335x-evm-06.00.00.07/linux-devkit/sysroots/x86_64-arago-linux/usr/bin/arm-linux-gnueabihf-gcc
Please update variable: bbb_TI_PROC_SDK_DIR
in the file SDK_ROOT/scripts/front_matter.mak
ERROR: Cannot continue
../../scripts/front_matter.mak:138: recipe for target 'bbb_compiler_check' failed
make[1]: *** [bbb_compiler_check] Error 1
make[1]: Leaving directory '/home/book/ti/ti154stack_linux_x64_2_09_00_09/components/common'
../../scripts/front_matter.mak:223: recipe for target 'bbb' failed
make: *** [bbb] Error 2
~/ti/ti154stack_linux_x64_2_09_00_09
~/ti/ti154stack_linux_x64_2_09_00_09/components/nv ~/ti/ti154stack_linux_x64_2_09_00_09
make -f Makefile ARCH=bbb
make[1]: Entering directory '/home/book/ti/ti154stack_linux_x64_2_09_00_09/components/nv'
Cannot find BBB Compiler: /home/book/ti-processor-sdk-linux-am335x-evm-06.00.00.07/linux-devkit/sysroots/x86_64-arago-linux/usr/bin/arm-linux-gnueabihf-gcc
Please update variable: bbb_TI_PROC_SDK_DIR
in the file SDK_ROOT/scripts/front_matter.mak
ERROR: Cannot continue
../../scripts/front_matter.mak:138: recipe for target 'bbb_compiler_check' failed
make[1]: *** [bbb_compiler_check] Error 1
make[1]: Leaving directory '/home/book/ti/ti154stack_linux_x64_2_09_00_09/components/nv'
../../scripts/front_matter.mak:223: recipe for target 'bbb' failed
make: *** [bbb] Error 2
~/ti/ti154stack_linux_x64_2_09_00_09
~/ti/ti154stack_linux_x64_2_09_00_09/components/api ~/ti/ti154stack_linux_x64_2_09_00_09
make -f Makefile ARCH=bbb
make[1]: Entering directory '/home/book/ti/ti154stack_linux_x64_2_09_00_09/components/api'
Cannot find BBB Compiler: /home/book/ti-processor-sdk-linux-am335x-evm-06.00.00.07/linux-devkit/sysroots/x86_64-arago-linux/usr/bin/arm-linux-gnueabihf-gcc
Please update variable: bbb_TI_PROC_SDK_DIR
in the file SDK_ROOT/scripts/front_matter.mak
ERROR: Cannot continue
../../scripts/front_matter.mak:138: recipe for target 'bbb_compiler_check' failed
make[1]: *** [bbb_compiler_check] Error 1
make[1]: Leaving directory '/home/book/ti/ti154stack_linux_x64_2_09_00_09/components/api'
../../scripts/front_matter.mak:223: recipe for target 'bbb' failed
make: *** [bbb] Error 2
~/ti/ti154stack_linux_x64_2_09_00_09
~/ti/ti154stack_linux_x64_2_09_00_09/example/npi_server2 ~/ti/ti154stack_linux_x64_2_09_00_09
make -f Makefile ARCH=bbb
make[1]: Entering directory '/home/book/ti/ti154stack_linux_x64_2_09_00_09/example/npi_server2'
Cannot find BBB Compiler: /home/book/ti-processor-sdk-linux-am335x-evm-06.00.00.07/linux-devkit/sysroots/x86_64-arago-linux/usr/bin/arm-linux-gnueabihf-gcc
Please update variable: bbb_TI_PROC_SDK_DIR
in the file SDK_ROOT/scripts/front_matter.mak
ERROR: Cannot continue
../../scripts/front_matter.mak:138: recipe for target 'bbb_compiler_check' failed
make[1]: *** [bbb_compiler_check] Error 1
make[1]: Leaving directory '/home/book/ti/ti154stack_linux_x64_2_09_00_09/example/npi_server2'
../../scripts/front_matter.mak:223: recipe for target 'bbb' failed
make: *** [bbb] Error 2
~/ti/ti154stack_linux_x64_2_09_00_09
~/ti/ti154stack_linux_x64_2_09_00_09/example/collector ~/ti/ti154stack_linux_x64_2_09_00_09
make -f Makefile ARCH=bbb
make[1]: Entering directory '/home/book/ti/ti154stack_linux_x64_2_09_00_09/example/collector'
Cannot find BBB Compiler: /home/book/ti-processor-sdk-linux-am335x-evm-06.00.00.07/linux-devkit/sysroots/x86_64-arago-linux/usr/bin/arm-linux-gnueabihf-gcc
Please update variable: bbb_TI_PROC_SDK_DIR
in the file SDK_ROOT/scripts/front_matter.mak
ERROR: Cannot continue
../../scripts/front_matter.mak:138: recipe for target 'bbb_compiler_check' failed
make[1]: *** [bbb_compiler_check] Error 1
make[1]: Leaving directory '/home/book/ti/ti154stack_linux_x64_2_09_00_09/example/collector'
../../scripts/front_matter.mak:223: recipe for target 'bbb' failed
make: *** [bbb] Error 2
~/ti/ti154stack_linux_x64_2_09_00_09
~/ti/ti154stack_linux_x64_2_09_00_09/example/cc13xx-sbl/app/linux ~/ti/ti154stack_linux_x64_2_09_00_09
ERROR: Cannot find BBB Compiler: /home/book/ti-processor-sdk-linux-am335x-evm-06.00.00.07/linux-devkit/sysroots/x86_64-arago-linux/usr/bin/arm-linux-gnueabihf-gcc
ERROR: Please update variable: BBB_PREFIX
in the file SDK_ROOT/cc13xx-sbl/app/linux/Makefile
ERROR: Cannot continue
Makefile:54: recipe for target 'bbb_compiler_check' failed
make: *** [bbb_compiler_check] Error 1
~/ti/ti154stack_linux_x64_2_09_00_09
book@www.100ask.org:~/ti/ti154stack_linux_x64_2_09_00_09$

Lucifer