This thread has been locked.

If you have a related question, please click the "Ask a related question" button in the top right corner. The newly created question will be automatically linked to this question.

[参考译文] IWR6843AOPEVM:为 IWR6843AOPEVM 修订版编译示例时出现问题。

Guru**** 1953960 points
Other Parts Discussed in Thread: CCSTUDIO
请注意,本文内容源自机器翻译,可能存在语法或其它翻译错误,仅供参考。如需获取准确内容,请参阅链接中的英语原文或自行翻译。

https://e2e.ti.com/support/sensors-group/sensors/f/sensors-forum/1408520/iwr6843aopevm-problem-to-compile-example-for-iwr6843aopevm-revg

器件型号:IWR6843AOPEVM
Thread 中讨论的其他器件:CCStudio

工具与软件:

我正在尝试编译名为3D_people_track_6843_dss3D_people_track_6843_mss的示例。 根据该文档、在编译 MSS 之前必须先编译 DSS。

目前我无法编译 DSS;它显示以下错误、指示它无法在"DSPLib"文件夹中找到文件。

dss/modules/caponBF2D/Est2D/ src subdir_rules.mk:7:目标"ss/modules/caponBF2D/CAPDEMO/RADARDEMO_AoaEst2DCaponBF.oe674"的配方 src 失败
"../dss/modules/caponBF2D / src / RADARDEMO_aoaEst2DCaponBF_priv.h"、第69行:致命错误#1965:无法打开源文件"ti/DSPLIB/DSPF_sp_fftSPxSP/DSPF_sp_fftSPxSP.h" src

Fullscreen
1
2
3
4
5
6
7
8
9
10
11
12
13
14
15
16
17
18
19
20
21
>> Compilation failure
dss/modules/caponBF2D/src/subdir_rules.mk:7: recipe for target 'dss/modules/caponBF2D/src/RADARDEMO_aoaEst2DCaponBF.oe674' failed
"../dss/modules/caponBF2D/src/RADARDEMO_aoaEst2DCaponBF_priv.h", line 69: fatal error #1965: cannot open source file "ti/dsplib/src/DSPF_sp_fftSPxSP/DSPF_sp_fftSPxSP.h"
1 catastrophic error detected in the compilation of "../dss/modules/caponBF2D/src/RADARDEMO_aoaEst2DCaponBF.c".
Compilation terminated.
gmake: *** [dss/modules/caponBF2D/src/RADARDEMO_aoaEst2DCaponBF.oe674] Error 1
"../dss/modules/caponBF2D/src/RADARDEMO_aoaEst2DCaponBF_priv.h", line 69: fatal error #1965: cannot open source file "ti/dsplib/src/DSPF_sp_fftSPxSP/DSPF_sp_fftSPxSP.h"
1 catastrophic error detected in the compilation of "../dss/modules/caponBF2D/src/RADARDEMO_aoaEst2DCaponBF_DopplerEst.c".
Compilation terminated.
gmake: *** [dss/modules/caponBF2D/src/RADARDEMO_aoaEst2DCaponBF_DopplerEst.oe674] Error 1
"/home/oee_dev-001/ti/radar_toolbox_2_20_00_05/source/ti/dpu/capon3d/modules/DoA/CaponBF2D/src/RADARDEMO_aoaEst2DCaponBF_priv.h", line 69: fatal error #1965: cannot open source file "ti/dsplib/src/DSPF_sp_fftSPxSP/DSPF_sp_fftSPxSP.h"
1 catastrophic error detected in the compilation of "../dss/modules/caponBF2D/src/RADARDEMO_aoaEst2DCaponBF_bpmDecoding.c".
Compilation terminated.
gmake: *** [dss/modules/caponBF2D/src/RADARDEMO_aoaEst2DCaponBF_bpmDecoding.oe674] Error 1
"../dss/modules/caponBF2D/src/RADARDEMO_aoaEst2DCaponBF_priv.h", line 69: fatal error #1965: cannot open source file "ti/dsplib/src/DSPF_sp_fftSPxSP/DSPF_sp_fftSPxSP.h"
1 catastrophic error detected in the compilation of "../dss/modules/caponBF2D/src/RADARDEMO_aoaEst2DCaponBF_angleEst.c".
Compilation terminated.
gmake: *** [dss/modules/caponBF2D/src/RADARDEMO_aoaEst2DCaponBF_angleEst.oe674] Error 1
"/home/oee_dev-001/ti/radar_toolbox_2_20_00_05/source/ti/dpu/capon3d/modules/DoA/CaponBF2D/src/RADARDEMO_aoaEst2DCaponBF_priv.h", line 69: fatal error #1965: cannot open source file "ti/dsplib/src/DSPF_sp_fftSPxSP/DSPF_sp_fftSPxSP.h"
1 catastrophic error detected in the compilation of "../dss/modules/caponBF2D/src/RADARDEMO_aoaEst2DCaponBF_heatmapEst.c".
Compilation terminated.
XXXXXXXXXXXXXXXXXXXXXXXXXXXXXXXXXXXXXXXXXXXXXXXXXX

有人知道如何安装此库吗? 我执行了 CCStudio 的完全安装、还安装了毫米波 SDK。

附注:我在非官方存储库中导航 GitLab 找到了 DSPLIB 文件夹。 我已尝试验证它包含编译所查找的文件并将文件夹添加到所示路径、但仍然会出现错误。

  • 请注意,本文内容源自机器翻译,可能存在语法或其它翻译错误,仅供参考。如需获取准确内容,请参阅链接中的英语原文或自行翻译。

    你(们)好

    感谢您的提问。 请允许我们在几天内回复

    此致

  • 请注意,本文内容源自机器翻译,可能存在语法或其它翻译错误,仅供参考。如需获取准确内容,请参阅链接中的英语原文或自行翻译。

    您好!

    在 CCS 中、导航到 Help->install 器件支持。 这将打开一个新屏幕、关闭 CCS。 单击直至进入自定义安装、然后选择  

    C6000经过功耗优化的 DSP 器件以及毫米波传感器。

    此致!

    耐特

x 出现错误。请重试或与管理员联系。